{"text_format":"1","workbook":"xlsx","n_sheets":3,"sheets":["DU LIEU NHAP VAO","LICH","About"],"not_rendered":{"charts":0,"images":0,"macros":1,"external_links":0,"defined_names":1,"comments":0,"pivot_tables":0},"unopened":[],"bounds":{"document_bytes":16777216,"sheet_cells":100000,"rows_first":2000,"rows_last":500,"rows_between":2000,"halvings":0,"cell_chars":16384,"cell_head_chars":4096},"cells_cut":0,"cells_raw":0,"read":"whole","date_system":"1900"}

{"sheet":"DU LIEU NHAP VAO","index":0,"n_rows":204,"n_cols":9,"rows_kept":204,"cut":false,"hidden":false,"merged":[[0,0,0,4],[1,0,1,4]]}
[{"$f":"\"LỊCH HẸN ??????\nTRONG NĂM \" & YEAR(NOW())","v":"LỊCH HẸN ??????\nTRONG NĂM 2017"}]
[{"$f":"\"In lúc: \"&IF(HOUR(NOW())<10,\"0\"&HOUR(NOW()),HOUR(NOW()))&\":\"&IF(MINUTE(NOW())<10,\"0\"&MINUTE(NOW()),MINUTE(NOW()))&\":\"&IF(SECOND(NOW())<10,\"0\"&SECOND(NOW()),SECOND(NOW()))&\". Ngày \"&IF(DAY(NOW())<10,\"0\"&DAY(NOW()),DAY(NOW()))&\" tháng \"&IF(MONTH(NOW())<10,\"0\"&MONTH(NOW()),MONTH(NOW()))&\" năm \"&YEAR(NOW()) & \" (nhằm \" & TEXT(I5,\"dd.mm.yyyy\") & \" Âm lịch)\"","v":"In lúc: 23:20:38. Ngày 10 tháng 03 năm 2017 (nhằm 13.02.2017 Âm lịch)"}]
[]
["Stt","Ngày Âm Lịch","Lý do","Người lo","Ghi chú",null,"Ghi chú: ","Ngày DL:","Ngày ÂL:"]
[{"$f":"IF(C5=\"\",\"\",1)","v":1},"2017-03-05","Công việc 1","nhà",null,null,"Hôm nay:",{"$f":"NOW()","v":"2017-03-10T23:20:37.630"},{"$f":"amlich(H5)","v":"2017-02-13"}]
[{"$f":"IF(C6=\"\",\"\",MAX($A$5:A5)+ 1)","v":2},"2017-04-07","công việc 2","chú 6",null,null,null,"Năm ÂL:",{"$f":"YEAR(I5)","v":2017}]
[{"$f":"IF(C7=\"\",\"\",MAX($A$5:A6)+ 1)","v":""}]
[{"$f":"IF(C8=\"\",\"\",MAX($A$5:A7)+ 1)","v":""}]
[{"$f":"IF(C9=\"\",\"\",MAX($A$5:A8)+ 1)","v":""}]
[{"$f":"IF(C10=\"\",\"\",MAX($A$5:A9)+ 1)","v":""}]
[{"$f":"IF(C11=\"\",\"\",MAX($A$5:A10)+ 1)","v":""}]
[{"$f":"IF(C12=\"\",\"\",MAX($A$5:A11)+ 1)","v":""}]
[{"$f":"IF(C13=\"\",\"\",MAX($A$5:A12)+ 1)","v":""}]
[{"$f":"IF(C14=\"\",\"\",MAX($A$5:A13)+ 1)","v":""}]
[{"$f":"IF(C15=\"\",\"\",MAX($A$5:A14)+ 1)","v":""}]
[{"$f":"IF(C16=\"\",\"\",MAX($A$5:A15)+ 1)","v":""}]
[{"$f":"IF(C17=\"\",\"\",MAX($A$5:A16)+ 1)","v":""}]
[{"$f":"IF(C18=\"\",\"\",MAX($A$5:A17)+ 1)","v":""}]
[{"$f":"IF(C19=\"\",\"\",MAX($A$5:A18)+ 1)","v":""}]
[{"$f":"IF(C20=\"\",\"\",MAX($A$5:A19)+ 1)","v":""}]
[{"$f":"IF(C21=\"\",\"\",MAX($A$5:A20)+ 1)","v":""}]
[{"$f":"IF(C22=\"\",\"\",MAX($A$5:A21)+ 1)","v":""}]
[{"$f":"IF(C23=\"\",\"\",MAX($A$5:A22)+ 1)","v":""}]
[{"$f":"IF(C24=\"\",\"\",MAX($A$5:A23)+ 1)","v":""}]
[{"$f":"IF(C25=\"\",\"\",MAX($A$5:A24)+ 1)","v":""}]
[{"$f":"IF(C26=\"\",\"\",MAX($A$5:A25)+ 1)","v":""}]
[{"$f":"IF(C27=\"\",\"\",MAX($A$5:A26)+ 1)","v":""}]
[{"$f":"IF(C28=\"\",\"\",MAX($A$5:A27)+ 1)","v":""}]
[{"$f":"IF(C29=\"\",\"\",MAX($A$5:A28)+ 1)","v":""}]
[{"$f":"IF(C30=\"\",\"\",MAX($A$5:A29)+ 1)","v":""}]
[{"$f":"IF(C31=\"\",\"\",MAX($A$5:A30)+ 1)","v":""}]
[{"$f":"IF(C32=\"\",\"\",MAX($A$5:A31)+ 1)","v":""}]
[{"$f":"IF(C33=\"\",\"\",MAX($A$5:A32)+ 1)","v":""}]
[{"$f":"IF(C34=\"\",\"\",MAX($A$5:A33)+ 1)","v":""}]
[{"$f":"IF(C35=\"\",\"\",MAX($A$5:A34)+ 1)","v":""}]
[{"$f":"IF(C36=\"\",\"\",MAX($A$5:A35)+ 1)","v":""}]
[{"$f":"IF(C37=\"\",\"\",MAX($A$5:A36)+ 1)","v":""}]
[{"$f":"IF(C38=\"\",\"\",MAX($A$5:A37)+ 1)","v":""}]
[{"$f":"IF(C39=\"\",\"\",MAX($A$5:A38)+ 1)","v":""}]
[{"$f":"IF(C40=\"\",\"\",MAX($A$5:A39)+ 1)","v":""}]
[{"$f":"IF(C41=\"\",\"\",MAX($A$5:A40)+ 1)","v":""}]
[{"$f":"IF(C42=\"\",\"\",MAX($A$5:A41)+ 1)","v":""}]
[{"$f":"IF(C43=\"\",\"\",MAX($A$5:A42)+ 1)","v":""}]
[{"$f":"IF(C44=\"\",\"\",MAX($A$5:A43)+ 1)","v":""}]
[{"$f":"IF(C45=\"\",\"\",MAX($A$5:A44)+ 1)","v":""}]
[{"$f":"IF(C46=\"\",\"\",MAX($A$5:A45)+ 1)","v":""}]
[{"$f":"IF(C47=\"\",\"\",MAX($A$5:A46)+ 1)","v":""}]
[{"$f":"IF(C48=\"\",\"\",MAX($A$5:A47)+ 1)","v":""}]
[{"$f":"IF(C49=\"\",\"\",MAX($A$5:A48)+ 1)","v":""}]
[{"$f":"IF(C50=\"\",\"\",MAX($A$5:A49)+ 1)","v":""}]
[{"$f":"IF(C51=\"\",\"\",MAX($A$5:A50)+ 1)","v":""}]
[{"$f":"IF(C52=\"\",\"\",MAX($A$5:A51)+ 1)","v":""}]
[{"$f":"IF(C53=\"\",\"\",MAX($A$5:A52)+ 1)","v":""}]
[{"$f":"IF(C54=\"\",\"\",MAX($A$5:A53)+ 1)","v":""}]
[{"$f":"IF(C55=\"\",\"\",MAX($A$5:A54)+ 1)","v":""}]
[{"$f":"IF(C56=\"\",\"\",MAX($A$5:A55)+ 1)","v":""}]
[{"$f":"IF(C57=\"\",\"\",MAX($A$5:A56)+ 1)","v":""}]
[{"$f":"IF(C58=\"\",\"\",MAX($A$5:A57)+ 1)","v":""}]
[{"$f":"IF(C59=\"\",\"\",MAX($A$5:A58)+ 1)","v":""}]
[{"$f":"IF(C60=\"\",\"\",MAX($A$5:A59)+ 1)","v":""}]
[{"$f":"IF(C61=\"\",\"\",MAX($A$5:A60)+ 1)","v":""}]
[{"$f":"IF(C62=\"\",\"\",MAX($A$5:A61)+ 1)","v":""}]
[{"$f":"IF(C63=\"\",\"\",MAX($A$5:A62)+ 1)","v":""}]
[{"$f":"IF(C64=\"\",\"\",MAX($A$5:A63)+ 1)","v":""}]
[{"$f":"IF(C65=\"\",\"\",MAX($A$5:A64)+ 1)","v":""}]
[{"$f":"IF(C66=\"\",\"\",MAX($A$5:A65)+ 1)","v":""}]
[{"$f":"IF(C67=\"\",\"\",MAX($A$5:A66)+ 1)","v":""}]
[{"$f":"IF(C68=\"\",\"\",MAX($A$5:A67)+ 1)","v":""}]
[{"$f":"IF(C69=\"\",\"\",MAX($A$5:A68)+ 1)","v":""}]
[{"$f":"IF(C70=\"\",\"\",MAX($A$5:A69)+ 1)","v":""}]
[{"$f":"IF(C71=\"\",\"\",MAX($A$5:A70)+ 1)","v":""}]
[{"$f":"IF(C72=\"\",\"\",MAX($A$5:A71)+ 1)","v":""}]
[{"$f":"IF(C73=\"\",\"\",MAX($A$5:A72)+ 1)","v":""}]
[{"$f":"IF(C74=\"\",\"\",MAX($A$5:A73)+ 1)","v":""}]
[{"$f":"IF(C75=\"\",\"\",MAX($A$5:A74)+ 1)","v":""}]
[{"$f":"IF(C76=\"\",\"\",MAX($A$5:A75)+ 1)","v":""}]
[{"$f":"IF(C77=\"\",\"\",MAX($A$5:A76)+ 1)","v":""}]
[{"$f":"IF(C78=\"\",\"\",MAX($A$5:A77)+ 1)","v":""}]
[{"$f":"IF(C79=\"\",\"\",MAX($A$5:A78)+ 1)","v":""}]
[{"$f":"IF(C80=\"\",\"\",MAX($A$5:A79)+ 1)","v":""}]
[{"$f":"IF(C81=\"\",\"\",MAX($A$5:A80)+ 1)","v":""}]
[{"$f":"IF(C82=\"\",\"\",MAX($A$5:A81)+ 1)","v":""}]
[{"$f":"IF(C83=\"\",\"\",MAX($A$5:A82)+ 1)","v":""}]
[{"$f":"IF(C84=\"\",\"\",MAX($A$5:A83)+ 1)","v":""}]
[{"$f":"IF(C85=\"\",\"\",MAX($A$5:A84)+ 1)","v":""}]
[{"$f":"IF(C86=\"\",\"\",MAX($A$5:A85)+ 1)","v":""}]
[{"$f":"IF(C87=\"\",\"\",MAX($A$5:A86)+ 1)","v":""}]
[{"$f":"IF(C88=\"\",\"\",MAX($A$5:A87)+ 1)","v":""}]
[{"$f":"IF(C89=\"\",\"\",MAX($A$5:A88)+ 1)","v":""}]
[{"$f":"IF(C90=\"\",\"\",MAX($A$5:A89)+ 1)","v":""}]
[{"$f":"IF(C91=\"\",\"\",MAX($A$5:A90)+ 1)","v":""}]
[{"$f":"IF(C92=\"\",\"\",MAX($A$5:A91)+ 1)","v":""}]
[{"$f":"IF(C93=\"\",\"\",MAX($A$5:A92)+ 1)","v":""}]
[{"$f":"IF(C94=\"\",\"\",MAX($A$5:A93)+ 1)","v":""}]
[{"$f":"IF(C95=\"\",\"\",MAX($A$5:A94)+ 1)","v":""}]
[{"$f":"IF(C96=\"\",\"\",MAX($A$5:A95)+ 1)","v":""}]
[{"$f":"IF(C97=\"\",\"\",MAX($A$5:A96)+ 1)","v":""}]
[{"$f":"IF(C98=\"\",\"\",MAX($A$5:A97)+ 1)","v":""}]
[{"$f":"IF(C99=\"\",\"\",MAX($A$5:A98)+ 1)","v":""}]
[{"$f":"IF(C100=\"\",\"\",MAX($A$5:A99)+ 1)","v":""}]
[{"$f":"IF(C101=\"\",\"\",MAX($A$5:A100)+ 1)","v":""}]
[{"$f":"IF(C102=\"\",\"\",MAX($A$5:A101)+ 1)","v":""}]
[{"$f":"IF(C103=\"\",\"\",MAX($A$5:A102)+ 1)","v":""}]
[{"$f":"IF(C104=\"\",\"\",MAX($A$5:A103)+ 1)","v":""}]
[{"$f":"IF(C105=\"\",\"\",MAX($A$5:A104)+ 1)","v":""}]
[{"$f":"IF(C106=\"\",\"\",MAX($A$5:A105)+ 1)","v":""}]
[{"$f":"IF(C107=\"\",\"\",MAX($A$5:A106)+ 1)","v":""}]
[{"$f":"IF(C108=\"\",\"\",MAX($A$5:A107)+ 1)","v":""}]
[{"$f":"IF(C109=\"\",\"\",MAX($A$5:A108)+ 1)","v":""}]
[{"$f":"IF(C110=\"\",\"\",MAX($A$5:A109)+ 1)","v":""}]
[{"$f":"IF(C111=\"\",\"\",MAX($A$5:A110)+ 1)","v":""}]
[{"$f":"IF(C112=\"\",\"\",MAX($A$5:A111)+ 1)","v":""}]
[{"$f":"IF(C113=\"\",\"\",MAX($A$5:A112)+ 1)","v":""}]
[{"$f":"IF(C114=\"\",\"\",MAX($A$5:A113)+ 1)","v":""}]
[{"$f":"IF(C115=\"\",\"\",MAX($A$5:A114)+ 1)","v":""}]
[{"$f":"IF(C116=\"\",\"\",MAX($A$5:A115)+ 1)","v":""}]
[{"$f":"IF(C117=\"\",\"\",MAX($A$5:A116)+ 1)","v":""}]
[{"$f":"IF(C118=\"\",\"\",MAX($A$5:A117)+ 1)","v":""}]
[{"$f":"IF(C119=\"\",\"\",MAX($A$5:A118)+ 1)","v":""}]
[{"$f":"IF(C120=\"\",\"\",MAX($A$5:A119)+ 1)","v":""}]
[{"$f":"IF(C121=\"\",\"\",MAX($A$5:A120)+ 1)","v":""}]
[{"$f":"IF(C122=\"\",\"\",MAX($A$5:A121)+ 1)","v":""}]
[{"$f":"IF(C123=\"\",\"\",MAX($A$5:A122)+ 1)","v":""}]
[{"$f":"IF(C124=\"\",\"\",MAX($A$5:A123)+ 1)","v":""}]
[{"$f":"IF(C125=\"\",\"\",MAX($A$5:A124)+ 1)","v":""}]
[{"$f":"IF(C126=\"\",\"\",MAX($A$5:A125)+ 1)","v":""}]
[{"$f":"IF(C127=\"\",\"\",MAX($A$5:A126)+ 1)","v":""}]
[{"$f":"IF(C128=\"\",\"\",MAX($A$5:A127)+ 1)","v":""}]
[{"$f":"IF(C129=\"\",\"\",MAX($A$5:A128)+ 1)","v":""}]
[{"$f":"IF(C130=\"\",\"\",MAX($A$5:A129)+ 1)","v":""}]
[{"$f":"IF(C131=\"\",\"\",MAX($A$5:A130)+ 1)","v":""}]
[{"$f":"IF(C132=\"\",\"\",MAX($A$5:A131)+ 1)","v":""}]
[{"$f":"IF(C133=\"\",\"\",MAX($A$5:A132)+ 1)","v":""}]
[{"$f":"IF(C134=\"\",\"\",MAX($A$5:A133)+ 1)","v":""}]
[{"$f":"IF(C135=\"\",\"\",MAX($A$5:A134)+ 1)","v":""}]
[{"$f":"IF(C136=\"\",\"\",MAX($A$5:A135)+ 1)","v":""}]
[{"$f":"IF(C137=\"\",\"\",MAX($A$5:A136)+ 1)","v":""}]
[{"$f":"IF(C138=\"\",\"\",MAX($A$5:A137)+ 1)","v":""}]
[{"$f":"IF(C139=\"\",\"\",MAX($A$5:A138)+ 1)","v":""}]
[{"$f":"IF(C140=\"\",\"\",MAX($A$5:A139)+ 1)","v":""}]
[{"$f":"IF(C141=\"\",\"\",MAX($A$5:A140)+ 1)","v":""}]
[{"$f":"IF(C142=\"\",\"\",MAX($A$5:A141)+ 1)","v":""}]
[{"$f":"IF(C143=\"\",\"\",MAX($A$5:A142)+ 1)","v":""}]
[{"$f":"IF(C144=\"\",\"\",MAX($A$5:A143)+ 1)","v":""}]
[{"$f":"IF(C145=\"\",\"\",MAX($A$5:A144)+ 1)","v":""}]
[{"$f":"IF(C146=\"\",\"\",MAX($A$5:A145)+ 1)","v":""}]
[{"$f":"IF(C147=\"\",\"\",MAX($A$5:A146)+ 1)","v":""}]
[{"$f":"IF(C148=\"\",\"\",MAX($A$5:A147)+ 1)","v":""}]
[{"$f":"IF(C149=\"\",\"\",MAX($A$5:A148)+ 1)","v":""}]
[{"$f":"IF(C150=\"\",\"\",MAX($A$5:A149)+ 1)","v":""}]
[{"$f":"IF(C151=\"\",\"\",MAX($A$5:A150)+ 1)","v":""}]
[{"$f":"IF(C152=\"\",\"\",MAX($A$5:A151)+ 1)","v":""}]
[{"$f":"IF(C153=\"\",\"\",MAX($A$5:A152)+ 1)","v":""}]
[{"$f":"IF(C154=\"\",\"\",MAX($A$5:A153)+ 1)","v":""}]
[{"$f":"IF(C155=\"\",\"\",MAX($A$5:A154)+ 1)","v":""}]
[{"$f":"IF(C156=\"\",\"\",MAX($A$5:A155)+ 1)","v":""}]
[{"$f":"IF(C157=\"\",\"\",MAX($A$5:A156)+ 1)","v":""}]
[{"$f":"IF(C158=\"\",\"\",MAX($A$5:A157)+ 1)","v":""}]
[{"$f":"IF(C159=\"\",\"\",MAX($A$5:A158)+ 1)","v":""}]
[{"$f":"IF(C160=\"\",\"\",MAX($A$5:A159)+ 1)","v":""}]
[{"$f":"IF(C161=\"\",\"\",MAX($A$5:A160)+ 1)","v":""}]
[{"$f":"IF(C162=\"\",\"\",MAX($A$5:A161)+ 1)","v":""}]
[{"$f":"IF(C163=\"\",\"\",MAX($A$5:A162)+ 1)","v":""}]
[{"$f":"IF(C164=\"\",\"\",MAX($A$5:A163)+ 1)","v":""}]
[{"$f":"IF(C165=\"\",\"\",MAX($A$5:A164)+ 1)","v":""}]
[{"$f":"IF(C166=\"\",\"\",MAX($A$5:A165)+ 1)","v":""}]
[{"$f":"IF(C167=\"\",\"\",MAX($A$5:A166)+ 1)","v":""}]
[{"$f":"IF(C168=\"\",\"\",MAX($A$5:A167)+ 1)","v":""}]
[{"$f":"IF(C169=\"\",\"\",MAX($A$5:A168)+ 1)","v":""}]
[{"$f":"IF(C170=\"\",\"\",MAX($A$5:A169)+ 1)","v":""}]
[{"$f":"IF(C171=\"\",\"\",MAX($A$5:A170)+ 1)","v":""}]
[{"$f":"IF(C172=\"\",\"\",MAX($A$5:A171)+ 1)","v":""}]
[{"$f":"IF(C173=\"\",\"\",MAX($A$5:A172)+ 1)","v":""}]
[{"$f":"IF(C174=\"\",\"\",MAX($A$5:A173)+ 1)","v":""}]
[{"$f":"IF(C175=\"\",\"\",MAX($A$5:A174)+ 1)","v":""}]
[{"$f":"IF(C176=\"\",\"\",MAX($A$5:A175)+ 1)","v":""}]
[{"$f":"IF(C177=\"\",\"\",MAX($A$5:A176)+ 1)","v":""}]
[{"$f":"IF(C178=\"\",\"\",MAX($A$5:A177)+ 1)","v":""}]
[{"$f":"IF(C179=\"\",\"\",MAX($A$5:A178)+ 1)","v":""}]
[{"$f":"IF(C180=\"\",\"\",MAX($A$5:A179)+ 1)","v":""}]
[{"$f":"IF(C181=\"\",\"\",MAX($A$5:A180)+ 1)","v":""}]
[{"$f":"IF(C182=\"\",\"\",MAX($A$5:A181)+ 1)","v":""}]
[{"$f":"IF(C183=\"\",\"\",MAX($A$5:A182)+ 1)","v":""}]
[{"$f":"IF(C184=\"\",\"\",MAX($A$5:A183)+ 1)","v":""}]
[{"$f":"IF(C185=\"\",\"\",MAX($A$5:A184)+ 1)","v":""}]
[{"$f":"IF(C186=\"\",\"\",MAX($A$5:A185)+ 1)","v":""}]
[{"$f":"IF(C187=\"\",\"\",MAX($A$5:A186)+ 1)","v":""}]
[{"$f":"IF(C188=\"\",\"\",MAX($A$5:A187)+ 1)","v":""}]
[{"$f":"IF(C189=\"\",\"\",MAX($A$5:A188)+ 1)","v":""}]
[{"$f":"IF(C190=\"\",\"\",MAX($A$5:A189)+ 1)","v":""}]
[{"$f":"IF(C191=\"\",\"\",MAX($A$5:A190)+ 1)","v":""}]
[{"$f":"IF(C192=\"\",\"\",MAX($A$5:A191)+ 1)","v":""}]
[{"$f":"IF(C193=\"\",\"\",MAX($A$5:A192)+ 1)","v":""}]
[{"$f":"IF(C194=\"\",\"\",MAX($A$5:A193)+ 1)","v":""}]
[{"$f":"IF(C195=\"\",\"\",MAX($A$5:A194)+ 1)","v":""}]
[{"$f":"IF(C196=\"\",\"\",MAX($A$5:A195)+ 1)","v":""}]
[{"$f":"IF(C197=\"\",\"\",MAX($A$5:A196)+ 1)","v":""}]
[{"$f":"IF(C198=\"\",\"\",MAX($A$5:A197)+ 1)","v":""}]
[{"$f":"IF(C199=\"\",\"\",MAX($A$5:A198)+ 1)","v":""}]
[{"$f":"IF(C200=\"\",\"\",MAX($A$5:A199)+ 1)","v":""}]
[{"$f":"IF(C201=\"\",\"\",MAX($A$5:A200)+ 1)","v":""}]
[{"$f":"IF(C202=\"\",\"\",MAX($A$5:A201)+ 1)","v":""}]
[{"$f":"IF(C203=\"\",\"\",MAX($A$5:A202)+ 1)","v":""}]
[{"$f":"IF(C204=\"\",\"\",MAX($A$5:A203)+ 1)","v":""}]

{"sheet":"LICH","index":1,"n_rows":205,"n_cols":15,"rows_kept":205,"cut":false,"hidden":false,"merged":[[0,0,0,6],[1,0,1,6],[3,8,3,11]]}
[{"$f":"'DU LIEU NHAP VAO'!A1:E1","v":"LỊCH HẸN ??????\nTRONG NĂM 2017"},null,null,null,null,null,null,null,null,null,null,null,"Ghi chú: ","Ngày DL:","Ngày ÂL:"]
[{"$f":"\"In lúc: \"&IF(HOUR(NOW())<10,\"0\"&HOUR(NOW()),HOUR(NOW()))&\":\"&IF(MINUTE(NOW())<10,\"0\"&MINUTE(NOW()),MINUTE(NOW()))&\":\"&IF(SECOND(NOW())<10,\"0\"&SECOND(NOW()),SECOND(NOW()))&\". Ngày \"&IF(DAY(NOW())<10,\"0\"&DAY(NOW()),DAY(NOW()))&\" tháng \"&IF(MONTH(NOW())<10,\"0\"&MONTH(NOW()),MONTH(NOW()))&\" năm \"&YEAR(NOW()) & \" (nhằm \" & TEXT(O2,\"dd.mm.yyyy\") & \" Âm lịch)\"","v":"In lúc: 23:20:38. Ngày 10 tháng 03 năm 2017 (nhằm 13.02.2017 Âm lịch)"},null,null,null,null,null,null,null,null,null,null,null,"Hôm nay:",{"$f":"NOW()","v":"2017-03-10T23:20:37.630"},{"$f":"amlich(N2)","v":"2017-02-13"}]
[null,null,null,null,null,null,null,null,null,null,null,null,null,"Năm ÂL:",{"$f":"YEAR(O2)","v":2017}]
[null,null,null,null,null,null,null,null,"ĐÓNG GÓP"]
["Stt","Thứ","Ngày DL","Ngày ÂL","Lý do","Người lo","Ghi chú","Dự báo",2017,2018,2019,2020]
[{"$f":"IF(C6=\"\",\"\",1)","v":1},{"$f":"IF(C6=\"\",\"\",IF(WEEKDAY(C6,1)=1,\"CN\",\"T\"&WEEKDAY(C6,1)))","v":"T7"},{"$f":"IF(ISERROR(duonglich(D6)),\"\",duonglich(D6))","v":"2017-04-01"},{"$f":"IF('DU LIEU NHAP VAO'!B5=\"\",\"\",TEXT('DU LIEU NHAP VAO'!B5,\"dd/MM\")&\"/\"&'DU LIEU NHAP VAO'!$I$6)","v":"05/03/2017"},{"$f":"IF('DU LIEU NHAP VAO'!C5 = \"\",\"\",'DU LIEU NHAP VAO'!C5)","v":"Công việc 1"},{"$f":"IF('DU LIEU NHAP VAO'!D5 = \"\",\"\",'DU LIEU NHAP VAO'!D5)","v":"nhà"},{"$f":"IF('DU LIEU NHAP VAO'!E5 = \"\",\"\",'DU LIEU NHAP VAO'!E5)","v":""},{"$f":"IF(E6=\"\",\"\",IF(AND(ABS(DAYS360($N$2,C6))<>0, YEAR(C6) = YEAR(NOW()),MONTH(C6) < MONTH(NOW())),\"Đã qua \"&ABS(DAYS360(C6,$N$2))&\" ngày\",\"Còn \"&ABS(DAYS360(C6,$N$2))&\" ngày\"))","v":"Còn 21 ngày"}]
[{"$f":"IF(C7=\"\",\"\",MAX($A$6:A6)+ 1)","v":2},{"$f":"IF(C7=\"\",\"\",IF(WEEKDAY(C7,1)=1,\"CN\",\"T\"&WEEKDAY(C7,1)))","v":"T3"},{"$f":"IF(ISERROR(duonglich(D7)),\"\",duonglich(D7))","v":"2017-05-02"},{"$f":"IF('DU LIEU NHAP VAO'!B6=\"\",\"\",TEXT('DU LIEU NHAP VAO'!B6,\"dd/MM\")&\"/\"&'DU LIEU NHAP VAO'!$I$6)","v":"07/04/2017"},{"$f":"IF('DU LIEU NHAP VAO'!C6 = \"\",\"\",'DU LIEU NHAP VAO'!C6)","v":"công việc 2"},{"$f":"IF('DU LIEU NHAP VAO'!D6 = \"\",\"\",'DU LIEU NHAP VAO'!D6)","v":"chú 6"},{"$f":"IF('DU LIEU NHAP VAO'!E6 = \"\",\"\",'DU LIEU NHAP VAO'!E6)","v":""},{"$f":"IF(E7=\"\",\"\",IF(AND(ABS(DAYS360($N$2,C7))<>0, YEAR(C7) = YEAR(NOW()),MONTH(C7) < MONTH(NOW())),\"Đã qua \"&ABS(DAYS360(C7,$N$2))&\" ngày\",\"Còn \"&ABS(DAYS360(C7,$N$2))&\" ngày\"))","v":"Còn 52 ngày"}]
[{"$f":"IF(C8=\"\",\"\",MAX($A$6:A7)+ 1)","v":""},"",{"$f":"IF(ISERROR(duonglich(D8)),\"\",duonglich(D8))","v":""},{"$f":"IF('DU LIEU NHAP VAO'!B7=\"\",\"\",TEXT('DU LIEU NHAP VAO'!B7,\"dd/MM\")&\"/\"&'DU LIEU NHAP VAO'!$I$6)","v":""},{"$f":"IF('DU LIEU NHAP VAO'!C7 = \"\",\"\",'DU LIEU NHAP VAO'!C7)","v":""},{"$f":"IF('DU LIEU NHAP VAO'!D7 = \"\",\"\",'DU LIEU NHAP VAO'!D7)","v":""},{"$f":"IF('DU LIEU NHAP VAO'!E7 = \"\",\"\",'DU LIEU NHAP VAO'!E7)","v":""},""]
[{"$f":"IF(C9=\"\",\"\",MAX($A$6:A8)+ 1)","v":""},"",{"$f":"IF(ISERROR(duonglich(D9)),\"\",duonglich(D9))","v":""},{"$f":"IF('DU LIEU NHAP VAO'!B8=\"\",\"\",TEXT('DU LIEU NHAP VAO'!B8,\"dd/MM\")&\"/\"&'DU LIEU NHAP VAO'!$I$6)","v":""},{"$f":"IF('DU LIEU NHAP VAO'!C8 = \"\",\"\",'DU LIEU NHAP VAO'!C8)","v":""},{"$f":"IF('DU LIEU NHAP VAO'!D8 = \"\",\"\",'DU LIEU NHAP VAO'!D8)","v":""},{"$f":"IF('DU LIEU NHAP VAO'!E8 = \"\",\"\",'DU LIEU NHAP VAO'!E8)","v":""},""]
[{"$f":"IF(C10=\"\",\"\",MAX($A$6:A9)+ 1)","v":""},"",{"$f":"IF(ISERROR(duonglich(D10)),\"\",duonglich(D10))","v":""},{"$f":"IF('DU LIEU NHAP VAO'!B9=\"\",\"\",TEXT('DU LIEU NHAP VAO'!B9,\"dd/MM\")&\"/\"&'DU LIEU NHAP VAO'!$I$6)","v":""},{"$f":"IF('DU LIEU NHAP VAO'!C9 = \"\",\"\",'DU LIEU NHAP VAO'!C9)","v":""},{"$f":"IF('DU LIEU NHAP VAO'!D9 = \"\",\"\",'DU LIEU NHAP VAO'!D9)","v":""},{"$f":"IF('DU LIEU NHAP VAO'!E9 = \"\",\"\",'DU LIEU NHAP VAO'!E9)","v":""},""]
[{"$f":"IF(C11=\"\",\"\",MAX($A$6:A10)+ 1)","v":""},"",{"$f":"IF(ISERROR(duonglich(D11)),\"\",duonglich(D11))","v":""},{"$f":"IF('DU LIEU NHAP VAO'!B10=\"\",\"\",TEXT('DU LIEU NHAP VAO'!B10,\"dd/MM\")&\"/\"&'DU LIEU NHAP VAO'!$I$6)","v":""},{"$f":"IF('DU LIEU NHAP VAO'!C10 = \"\",\"\",'DU LIEU NHAP VAO'!C10)","v":""},{"$f":"IF('DU LIEU NHAP VAO'!D10 = \"\",\"\",'DU LIEU NHAP VAO'!D10)","v":""},{"$f":"IF('DU LIEU NHAP VAO'!E10 = \"\",\"\",'DU LIEU NHAP VAO'!E10)","v":""},""]
[{"$f":"IF(C12=\"\",\"\",MAX($A$6:A11)+ 1)","v":""},"",{"$f":"IF(ISERROR(duonglich(D12)),\"\",duonglich(D12))","v":""},{"$f":"IF('DU LIEU NHAP VAO'!B11=\"\",\"\",TEXT('DU LIEU NHAP VAO'!B11,\"dd/MM\")&\"/\"&'DU LIEU NHAP VAO'!$I$6)","v":""},{"$f":"IF('DU LIEU NHAP VAO'!C11 = \"\",\"\",'DU LIEU NHAP VAO'!C11)","v":""},{"$f":"IF('DU LIEU NHAP VAO'!D11 = \"\",\"\",'DU LIEU NHAP VAO'!D11)","v":""},{"$f":"IF('DU LIEU NHAP VAO'!E11 = \"\",\"\",'DU LIEU NHAP VAO'!E11)","v":""},""]
[{"$f":"IF(C13=\"\",\"\",MAX($A$6:A12)+ 1)","v":""},"",{"$f":"IF(ISERROR(duonglich(D13)),\"\",duonglich(D13))","v":""},{"$f":"IF('DU LIEU NHAP VAO'!B12=\"\",\"\",TEXT('DU LIEU NHAP VAO'!B12,\"dd/MM\")&\"/\"&'DU LIEU NHAP VAO'!$I$6)","v":""},{"$f":"IF('DU LIEU NHAP VAO'!C12 = \"\",\"\",'DU LIEU NHAP VAO'!C12)","v":""},{"$f":"IF('DU LIEU NHAP VAO'!D12 = \"\",\"\",'DU LIEU NHAP VAO'!D12)","v":""},{"$f":"IF('DU LIEU NHAP VAO'!E12 = \"\",\"\",'DU LIEU NHAP VAO'!E12)","v":""},""]
[{"$f":"IF(C14=\"\",\"\",MAX($A$6:A13)+ 1)","v":""},"",{"$f":"IF(ISERROR(duonglich(D14)),\"\",duonglich(D14))","v":""},{"$f":"IF('DU LIEU NHAP VAO'!B13=\"\",\"\",TEXT('DU LIEU NHAP VAO'!B13,\"dd/MM\")&\"/\"&'DU LIEU NHAP VAO'!$I$6)","v":""},{"$f":"IF('DU LIEU NHAP VAO'!C13 = \"\",\"\",'DU LIEU NHAP VAO'!C13)","v":""},{"$f":"IF('DU LIEU NHAP VAO'!D13 = \"\",\"\",'DU LIEU NHAP VAO'!D13)","v":""},{"$f":"IF('DU LIEU NHAP VAO'!E13 = \"\",\"\",'DU LIEU NHAP VAO'!E13)","v":""},""]
[{"$f":"IF(C15=\"\",\"\",MAX($A$6:A14)+ 1)","v":""},"",{"$f":"IF(ISERROR(duonglich(D15)),\"\",duonglich(D15))","v":""},{"$f":"IF('DU LIEU NHAP VAO'!B14=\"\",\"\",TEXT('DU LIEU NHAP VAO'!B14,\"dd/MM\")&\"/\"&'DU LIEU NHAP VAO'!$I$6)","v":""},{"$f":"IF('DU LIEU NHAP VAO'!C14 = \"\",\"\",'DU LIEU NHAP VAO'!C14)","v":""},{"$f":"IF('DU LIEU NHAP VAO'!D14 = \"\",\"\",'DU LIEU NHAP VAO'!D14)","v":""},{"$f":"IF('DU LIEU NHAP VAO'!E14 = \"\",\"\",'DU LIEU NHAP VAO'!E14)","v":""},""]
[{"$f":"IF(C16=\"\",\"\",MAX($A$6:A15)+ 1)","v":""},"",{"$f":"IF(ISERROR(duonglich(D16)),\"\",duonglich(D16))","v":""},{"$f":"IF('DU LIEU NHAP VAO'!B15=\"\",\"\",TEXT('DU LIEU NHAP VAO'!B15,\"dd/MM\")&\"/\"&'DU LIEU NHAP VAO'!$I$6)","v":""},{"$f":"IF('DU LIEU NHAP VAO'!C15 = \"\",\"\",'DU LIEU NHAP VAO'!C15)","v":""},{"$f":"IF('DU LIEU NHAP VAO'!D15 = \"\",\"\",'DU LIEU NHAP VAO'!D15)","v":""},{"$f":"IF('DU LIEU NHAP VAO'!E15 = \"\",\"\",'DU LIEU NHAP VAO'!E15)","v":""},""]
[{"$f":"IF(C17=\"\",\"\",MAX($A$6:A16)+ 1)","v":""},"",{"$f":"IF(ISERROR(duonglich(D17)),\"\",duonglich(D17))","v":""},{"$f":"IF('DU LIEU NHAP VAO'!B16=\"\",\"\",TEXT('DU LIEU NHAP VAO'!B16,\"dd/MM\")&\"/\"&'DU LIEU NHAP VAO'!$I$6)","v":""},{"$f":"IF('DU LIEU NHAP VAO'!C16 = \"\",\"\",'DU LIEU NHAP VAO'!C16)","v":""},{"$f":"IF('DU LIEU NHAP VAO'!D16 = \"\",\"\",'DU LIEU NHAP VAO'!D16)","v":""},{"$f":"IF('DU LIEU NHAP VAO'!E16 = \"\",\"\",'DU LIEU NHAP VAO'!E16)","v":""},""]
[{"$f":"IF(C18=\"\",\"\",MAX($A$6:A17)+ 1)","v":""},"",{"$f":"IF(ISERROR(duonglich(D18)),\"\",duonglich(D18))","v":""},{"$f":"IF('DU LIEU NHAP VAO'!B17=\"\",\"\",TEXT('DU LIEU NHAP VAO'!B17,\"dd/MM\")&\"/\"&'DU LIEU NHAP VAO'!$I$6)","v":""},{"$f":"IF('DU LIEU NHAP VAO'!C17 = \"\",\"\",'DU LIEU NHAP VAO'!C17)","v":""},{"$f":"IF('DU LIEU NHAP VAO'!D17 = \"\",\"\",'DU LIEU NHAP VAO'!D17)","v":""},{"$f":"IF('DU LIEU NHAP VAO'!E17 = \"\",\"\",'DU LIEU NHAP VAO'!E17)","v":""},""]
[{"$f":"IF(C19=\"\",\"\",MAX($A$6:A18)+ 1)","v":""},"",{"$f":"IF(ISERROR(duonglich(D19)),\"\",duonglich(D19))","v":""},{"$f":"IF('DU LIEU NHAP VAO'!B18=\"\",\"\",TEXT('DU LIEU NHAP VAO'!B18,\"dd/MM\")&\"/\"&'DU LIEU NHAP VAO'!$I$6)","v":""},{"$f":"IF('DU LIEU NHAP VAO'!C18 = \"\",\"\",'DU LIEU NHAP VAO'!C18)","v":""},{"$f":"IF('DU LIEU NHAP VAO'!D18 = \"\",\"\",'DU LIEU NHAP VAO'!D18)","v":""},{"$f":"IF('DU LIEU NHAP VAO'!E18 = \"\",\"\",'DU LIEU NHAP VAO'!E18)","v":""},""]
[{"$f":"IF(C20=\"\",\"\",MAX($A$6:A19)+ 1)","v":""},"",{"$f":"IF(ISERROR(duonglich(D20)),\"\",duonglich(D20))","v":""},{"$f":"IF('DU LIEU NHAP VAO'!B19=\"\",\"\",TEXT('DU LIEU NHAP VAO'!B19,\"dd/MM\")&\"/\"&'DU LIEU NHAP VAO'!$I$6)","v":""},{"$f":"IF('DU LIEU NHAP VAO'!C19 = \"\",\"\",'DU LIEU NHAP VAO'!C19)","v":""},{"$f":"IF('DU LIEU NHAP VAO'!D19 = \"\",\"\",'DU LIEU NHAP VAO'!D19)","v":""},{"$f":"IF('DU LIEU NHAP VAO'!E19 = \"\",\"\",'DU LIEU NHAP VAO'!E19)","v":""},""]
[{"$f":"IF(C21=\"\",\"\",MAX($A$6:A20)+ 1)","v":""},"",{"$f":"IF(ISERROR(duonglich(D21)),\"\",duonglich(D21))","v":""},{"$f":"IF('DU LIEU NHAP VAO'!B20=\"\",\"\",TEXT('DU LIEU NHAP VAO'!B20,\"dd/MM\")&\"/\"&'DU LIEU NHAP VAO'!$I$6)","v":""},{"$f":"IF('DU LIEU NHAP VAO'!C20 = \"\",\"\",'DU LIEU NHAP VAO'!C20)","v":""},{"$f":"IF('DU LIEU NHAP VAO'!D20 = \"\",\"\",'DU LIEU NHAP VAO'!D20)","v":""},{"$f":"IF('DU LIEU NHAP VAO'!E20 = \"\",\"\",'DU LIEU NHAP VAO'!E20)","v":""},""]
[{"$f":"IF(C22=\"\",\"\",MAX($A$6:A21)+ 1)","v":""},"",{"$f":"IF(ISERROR(duonglich(D22)),\"\",duonglich(D22))","v":""},{"$f":"IF('DU LIEU NHAP VAO'!B21=\"\",\"\",TEXT('DU LIEU NHAP VAO'!B21,\"dd/MM\")&\"/\"&'DU LIEU NHAP VAO'!$I$6)","v":""},{"$f":"IF('DU LIEU NHAP VAO'!C21 = \"\",\"\",'DU LIEU NHAP VAO'!C21)","v":""},{"$f":"IF('DU LIEU NHAP VAO'!D21 = \"\",\"\",'DU LIEU NHAP VAO'!D21)","v":""},{"$f":"IF('DU LIEU NHAP VAO'!E21 = \"\",\"\",'DU LIEU NHAP VAO'!E21)","v":""},""]
[{"$f":"IF(C23=\"\",\"\",MAX($A$6:A22)+ 1)","v":""},"",{"$f":"IF(ISERROR(duonglich(D23)),\"\",duonglich(D23))","v":""},{"$f":"IF('DU LIEU NHAP VAO'!B22=\"\",\"\",TEXT('DU LIEU NHAP VAO'!B22,\"dd/MM\")&\"/\"&'DU LIEU NHAP VAO'!$I$6)","v":""},{"$f":"IF('DU LIEU NHAP VAO'!C22 = \"\",\"\",'DU LIEU NHAP VAO'!C22)","v":""},{"$f":"IF('DU LIEU NHAP VAO'!D22 = \"\",\"\",'DU LIEU NHAP VAO'!D22)","v":""},{"$f":"IF('DU LIEU NHAP VAO'!E22 = \"\",\"\",'DU LIEU NHAP VAO'!E22)","v":""},""]
[{"$f":"IF(C24=\"\",\"\",MAX($A$6:A23)+ 1)","v":""},"",{"$f":"IF(ISERROR(duonglich(D24)),\"\",duonglich(D24))","v":""},{"$f":"IF('DU LIEU NHAP VAO'!B23=\"\",\"\",TEXT('DU LIEU NHAP VAO'!B23,\"dd/MM\")&\"/\"&'DU LIEU NHAP VAO'!$I$6)","v":""},{"$f":"IF('DU LIEU NHAP VAO'!C23 = \"\",\"\",'DU LIEU NHAP VAO'!C23)","v":""},{"$f":"IF('DU LIEU NHAP VAO'!D23 = \"\",\"\",'DU LIEU NHAP VAO'!D23)","v":""},{"$f":"IF('DU LIEU NHAP VAO'!E23 = \"\",\"\",'DU LIEU NHAP VAO'!E23)","v":""},""]
[{"$f":"IF(C25=\"\",\"\",MAX($A$6:A24)+ 1)","v":""},"",{"$f":"IF(ISERROR(duonglich(D25)),\"\",duonglich(D25))","v":""},{"$f":"IF('DU LIEU NHAP VAO'!B24=\"\",\"\",TEXT('DU LIEU NHAP VAO'!B24,\"dd/MM\")&\"/\"&'DU LIEU NHAP VAO'!$I$6)","v":""},{"$f":"IF('DU LIEU NHAP VAO'!C24 = \"\",\"\",'DU LIEU NHAP VAO'!C24)","v":""},{"$f":"IF('DU LIEU NHAP VAO'!D24 = \"\",\"\",'DU LIEU NHAP VAO'!D24)","v":""},{"$f":"IF('DU LIEU NHAP VAO'!E24 = \"\",\"\",'DU LIEU NHAP VAO'!E24)","v":""},""]
[{"$f":"IF(C26=\"\",\"\",MAX($A$6:A25)+ 1)","v":""},"",{"$f":"IF(ISERROR(duonglich(D26)),\"\",duonglich(D26))","v":""},{"$f":"IF('DU LIEU NHAP VAO'!B25=\"\",\"\",TEXT('DU LIEU NHAP VAO'!B25,\"dd/MM\")&\"/\"&'DU LIEU NHAP VAO'!$I$6)","v":""},{"$f":"IF('DU LIEU NHAP VAO'!C25 = \"\",\"\",'DU LIEU NHAP VAO'!C25)","v":""},{"$f":"IF('DU LIEU NHAP VAO'!D25 = \"\",\"\",'DU LIEU NHAP VAO'!D25)","v":""},{"$f":"IF('DU LIEU NHAP VAO'!E25 = \"\",\"\",'DU LIEU NHAP VAO'!E25)","v":""},""]
[{"$f":"IF(C27=\"\",\"\",MAX($A$6:A26)+ 1)","v":""},"",{"$f":"IF(ISERROR(duonglich(D27)),\"\",duonglich(D27))","v":""},{"$f":"IF('DU LIEU NHAP VAO'!B26=\"\",\"\",TEXT('DU LIEU NHAP VAO'!B26,\"dd/MM\")&\"/\"&'DU LIEU NHAP VAO'!$I$6)","v":""},{"$f":"IF('DU LIEU NHAP VAO'!C26 = \"\",\"\",'DU LIEU NHAP VAO'!C26)","v":""},{"$f":"IF('DU LIEU NHAP VAO'!D26 = \"\",\"\",'DU LIEU NHAP VAO'!D26)","v":""},{"$f":"IF('DU LIEU NHAP VAO'!E26 = \"\",\"\",'DU LIEU NHAP VAO'!E26)","v":""},""]
[{"$f":"IF(C28=\"\",\"\",MAX($A$6:A27)+ 1)","v":""},"",{"$f":"IF(ISERROR(duonglich(D28)),\"\",duonglich(D28))","v":""},{"$f":"IF('DU LIEU NHAP VAO'!B27=\"\",\"\",TEXT('DU LIEU NHAP VAO'!B27,\"dd/MM\")&\"/\"&'DU LIEU NHAP VAO'!$I$6)","v":""},{"$f":"IF('DU LIEU NHAP VAO'!C27 = \"\",\"\",'DU LIEU NHAP VAO'!C27)","v":""},{"$f":"IF('DU LIEU NHAP VAO'!D27 = \"\",\"\",'DU LIEU NHAP VAO'!D27)","v":""},{"$f":"IF('DU LIEU NHAP VAO'!E27 = \"\",\"\",'DU LIEU NHAP VAO'!E27)","v":""},""]
[{"$f":"IF(C29=\"\",\"\",MAX($A$6:A28)+ 1)","v":""},"",{"$f":"IF(ISERROR(duonglich(D29)),\"\",duonglich(D29))","v":""},{"$f":"IF('DU LIEU NHAP VAO'!B28=\"\",\"\",TEXT('DU LIEU NHAP VAO'!B28,\"dd/MM\")&\"/\"&'DU LIEU NHAP VAO'!$I$6)","v":""},{"$f":"IF('DU LIEU NHAP VAO'!C28 = \"\",\"\",'DU LIEU NHAP VAO'!C28)","v":""},{"$f":"IF('DU LIEU NHAP VAO'!D28 = \"\",\"\",'DU LIEU NHAP VAO'!D28)","v":""},{"$f":"IF('DU LIEU NHAP VAO'!E28 = \"\",\"\",'DU LIEU NHAP VAO'!E28)","v":""},""]
[{"$f":"IF(C30=\"\",\"\",MAX($A$6:A29)+ 1)","v":""},"",{"$f":"IF(ISERROR(duonglich(D30)),\"\",duonglich(D30))","v":""},{"$f":"IF('DU LIEU NHAP VAO'!B29=\"\",\"\",TEXT('DU LIEU NHAP VAO'!B29,\"dd/MM\")&\"/\"&'DU LIEU NHAP VAO'!$I$6)","v":""},{"$f":"IF('DU LIEU NHAP VAO'!C29 = \"\",\"\",'DU LIEU NHAP VAO'!C29)","v":""},{"$f":"IF('DU LIEU NHAP VAO'!D29 = \"\",\"\",'DU LIEU NHAP VAO'!D29)","v":""},{"$f":"IF('DU LIEU NHAP VAO'!E29 = \"\",\"\",'DU LIEU NHAP VAO'!E29)","v":""},""]
[{"$f":"IF(C31=\"\",\"\",MAX($A$6:A30)+ 1)","v":""},"",{"$f":"IF(ISERROR(duonglich(D31)),\"\",duonglich(D31))","v":""},{"$f":"IF('DU LIEU NHAP VAO'!B30=\"\",\"\",TEXT('DU LIEU NHAP VAO'!B30,\"dd/MM\")&\"/\"&'DU LIEU NHAP VAO'!$I$6)","v":""},{"$f":"IF('DU LIEU NHAP VAO'!C30 = \"\",\"\",'DU LIEU NHAP VAO'!C30)","v":""},{"$f":"IF('DU LIEU NHAP VAO'!D30 = \"\",\"\",'DU LIEU NHAP VAO'!D30)","v":""},{"$f":"IF('DU LIEU NHAP VAO'!E30 = \"\",\"\",'DU LIEU NHAP VAO'!E30)","v":""},""]
[{"$f":"IF(C32=\"\",\"\",MAX($A$6:A31)+ 1)","v":""},"",{"$f":"IF(ISERROR(duonglich(D32)),\"\",duonglich(D32))","v":""},{"$f":"IF('DU LIEU NHAP VAO'!B31=\"\",\"\",TEXT('DU LIEU NHAP VAO'!B31,\"dd/MM\")&\"/\"&'DU LIEU NHAP VAO'!$I$6)","v":""},{"$f":"IF('DU LIEU NHAP VAO'!C31 = \"\",\"\",'DU LIEU NHAP VAO'!C31)","v":""},{"$f":"IF('DU LIEU NHAP VAO'!D31 = \"\",\"\",'DU LIEU NHAP VAO'!D31)","v":""},{"$f":"IF('DU LIEU NHAP VAO'!E31 = \"\",\"\",'DU LIEU NHAP VAO'!E31)","v":""},""]
[{"$f":"IF(C33=\"\",\"\",MAX($A$6:A32)+ 1)","v":""},"",{"$f":"IF(ISERROR(duonglich(D33)),\"\",duonglich(D33))","v":""},{"$f":"IF('DU LIEU NHAP VAO'!B32=\"\",\"\",TEXT('DU LIEU NHAP VAO'!B32,\"dd/MM\")&\"/\"&'DU LIEU NHAP VAO'!$I$6)","v":""},{"$f":"IF('DU LIEU NHAP VAO'!C32 = \"\",\"\",'DU LIEU NHAP VAO'!C32)","v":""},{"$f":"IF('DU LIEU NHAP VAO'!D32 = \"\",\"\",'DU LIEU NHAP VAO'!D32)","v":""},{"$f":"IF('DU LIEU NHAP VAO'!E32 = \"\",\"\",'DU LIEU NHAP VAO'!E32)","v":""},""]
[{"$f":"IF(C34=\"\",\"\",MAX($A$6:A33)+ 1)","v":""},"",{"$f":"IF(ISERROR(duonglich(D34)),\"\",duonglich(D34))","v":""},{"$f":"IF('DU LIEU NHAP VAO'!B33=\"\",\"\",TEXT('DU LIEU NHAP VAO'!B33,\"dd/MM\")&\"/\"&'DU LIEU NHAP VAO'!$I$6)","v":""},{"$f":"IF('DU LIEU NHAP VAO'!C33 = \"\",\"\",'DU LIEU NHAP VAO'!C33)","v":""},{"$f":"IF('DU LIEU NHAP VAO'!D33 = \"\",\"\",'DU LIEU NHAP VAO'!D33)","v":""},{"$f":"IF('DU LIEU NHAP VAO'!E33 = \"\",\"\",'DU LIEU NHAP VAO'!E33)","v":""},""]
[{"$f":"IF(C35=\"\",\"\",MAX($A$6:A34)+ 1)","v":""},"",{"$f":"IF(ISERROR(duonglich(D35)),\"\",duonglich(D35))","v":""},{"$f":"IF('DU LIEU NHAP VAO'!B34=\"\",\"\",TEXT('DU LIEU NHAP VAO'!B34,\"dd/MM\")&\"/\"&'DU LIEU NHAP VAO'!$I$6)","v":""},{"$f":"IF('DU LIEU NHAP VAO'!C34 = \"\",\"\",'DU LIEU NHAP VAO'!C34)","v":""},{"$f":"IF('DU LIEU NHAP VAO'!D34 = \"\",\"\",'DU LIEU NHAP VAO'!D34)","v":""},{"$f":"IF('DU LIEU NHAP VAO'!E34 = \"\",\"\",'DU LIEU NHAP VAO'!E34)","v":""},""]
[{"$f":"IF(C36=\"\",\"\",MAX($A$6:A35)+ 1)","v":""},"",{"$f":"IF(ISERROR(duonglich(D36)),\"\",duonglich(D36))","v":""},{"$f":"IF('DU LIEU NHAP VAO'!B35=\"\",\"\",TEXT('DU LIEU NHAP VAO'!B35,\"dd/MM\")&\"/\"&'DU LIEU NHAP VAO'!$I$6)","v":""},{"$f":"IF('DU LIEU NHAP VAO'!C35 = \"\",\"\",'DU LIEU NHAP VAO'!C35)","v":""},{"$f":"IF('DU LIEU NHAP VAO'!D35 = \"\",\"\",'DU LIEU NHAP VAO'!D35)","v":""},{"$f":"IF('DU LIEU NHAP VAO'!E35 = \"\",\"\",'DU LIEU NHAP VAO'!E35)","v":""},""]
[{"$f":"IF(C37=\"\",\"\",MAX($A$6:A36)+ 1)","v":""},"",{"$f":"IF(ISERROR(duonglich(D37)),\"\",duonglich(D37))","v":""},{"$f":"IF('DU LIEU NHAP VAO'!B36=\"\",\"\",TEXT('DU LIEU NHAP VAO'!B36,\"dd/MM\")&\"/\"&'DU LIEU NHAP VAO'!$I$6)","v":""},{"$f":"IF('DU LIEU NHAP VAO'!C36 = \"\",\"\",'DU LIEU NHAP VAO'!C36)","v":""},{"$f":"IF('DU LIEU NHAP VAO'!D36 = \"\",\"\",'DU LIEU NHAP VAO'!D36)","v":""},{"$f":"IF('DU LIEU NHAP VAO'!E36 = \"\",\"\",'DU LIEU NHAP VAO'!E36)","v":""},""]
[{"$f":"IF(C38=\"\",\"\",MAX($A$6:A37)+ 1)","v":""},"",{"$f":"IF(ISERROR(duonglich(D38)),\"\",duonglich(D38))","v":""},{"$f":"IF('DU LIEU NHAP VAO'!B37=\"\",\"\",TEXT('DU LIEU NHAP VAO'!B37,\"dd/MM\")&\"/\"&'DU LIEU NHAP VAO'!$I$6)","v":""},{"$f":"IF('DU LIEU NHAP VAO'!C37 = \"\",\"\",'DU LIEU NHAP VAO'!C37)","v":""},{"$f":"IF('DU LIEU NHAP VAO'!D37 = \"\",\"\",'DU LIEU NHAP VAO'!D37)","v":""},{"$f":"IF('DU LIEU NHAP VAO'!E37 = \"\",\"\",'DU LIEU NHAP VAO'!E37)","v":""},""]
[{"$f":"IF(C39=\"\",\"\",MAX($A$6:A38)+ 1)","v":""},"",{"$f":"IF(ISERROR(duonglich(D39)),\"\",duonglich(D39))","v":""},{"$f":"IF('DU LIEU NHAP VAO'!B38=\"\",\"\",TEXT('DU LIEU NHAP VAO'!B38,\"dd/MM\")&\"/\"&'DU LIEU NHAP VAO'!$I$6)","v":""},{"$f":"IF('DU LIEU NHAP VAO'!C38 = \"\",\"\",'DU LIEU NHAP VAO'!C38)","v":""},{"$f":"IF('DU LIEU NHAP VAO'!D38 = \"\",\"\",'DU LIEU NHAP VAO'!D38)","v":""},{"$f":"IF('DU LIEU NHAP VAO'!E38 = \"\",\"\",'DU LIEU NHAP VAO'!E38)","v":""},""]
[{"$f":"IF(C40=\"\",\"\",MAX($A$6:A39)+ 1)","v":""},"",{"$f":"IF(ISERROR(duonglich(D40)),\"\",duonglich(D40))","v":""},{"$f":"IF('DU LIEU NHAP VAO'!B39=\"\",\"\",TEXT('DU LIEU NHAP VAO'!B39,\"dd/MM\")&\"/\"&'DU LIEU NHAP VAO'!$I$6)","v":""},{"$f":"IF('DU LIEU NHAP VAO'!C39 = \"\",\"\",'DU LIEU NHAP VAO'!C39)","v":""},{"$f":"IF('DU LIEU NHAP VAO'!D39 = \"\",\"\",'DU LIEU NHAP VAO'!D39)","v":""},{"$f":"IF('DU LIEU NHAP VAO'!E39 = \"\",\"\",'DU LIEU NHAP VAO'!E39)","v":""},""]
[{"$f":"IF(C41=\"\",\"\",MAX($A$6:A40)+ 1)","v":""},"",{"$f":"IF(ISERROR(duonglich(D41)),\"\",duonglich(D41))","v":""},{"$f":"IF('DU LIEU NHAP VAO'!B40=\"\",\"\",TEXT('DU LIEU NHAP VAO'!B40,\"dd/MM\")&\"/\"&'DU LIEU NHAP VAO'!$I$6)","v":""},{"$f":"IF('DU LIEU NHAP VAO'!C40 = \"\",\"\",'DU LIEU NHAP VAO'!C40)","v":""},{"$f":"IF('DU LIEU NHAP VAO'!D40 = \"\",\"\",'DU LIEU NHAP VAO'!D40)","v":""},{"$f":"IF('DU LIEU NHAP VAO'!E40 = \"\",\"\",'DU LIEU NHAP VAO'!E40)","v":""},""]
[{"$f":"IF(C42=\"\",\"\",MAX($A$6:A41)+ 1)","v":""},"",{"$f":"IF(ISERROR(duonglich(D42)),\"\",duonglich(D42))","v":""},{"$f":"IF('DU LIEU NHAP VAO'!B41=\"\",\"\",TEXT('DU LIEU NHAP VAO'!B41,\"dd/MM\")&\"/\"&'DU LIEU NHAP VAO'!$I$6)","v":""},{"$f":"IF('DU LIEU NHAP VAO'!C41 = \"\",\"\",'DU LIEU NHAP VAO'!C41)","v":""},{"$f":"IF('DU LIEU NHAP VAO'!D41 = \"\",\"\",'DU LIEU NHAP VAO'!D41)","v":""},{"$f":"IF('DU LIEU NHAP VAO'!E41 = \"\",\"\",'DU LIEU NHAP VAO'!E41)","v":""},""]
[{"$f":"IF(C43=\"\",\"\",MAX($A$6:A42)+ 1)","v":""},"",{"$f":"IF(ISERROR(duonglich(D43)),\"\",duonglich(D43))","v":""},{"$f":"IF('DU LIEU NHAP VAO'!B42=\"\",\"\",TEXT('DU LIEU NHAP VAO'!B42,\"dd/MM\")&\"/\"&'DU LIEU NHAP VAO'!$I$6)","v":""},{"$f":"IF('DU LIEU NHAP VAO'!C42 = \"\",\"\",'DU LIEU NHAP VAO'!C42)","v":""},{"$f":"IF('DU LIEU NHAP VAO'!D42 = \"\",\"\",'DU LIEU NHAP VAO'!D42)","v":""},{"$f":"IF('DU LIEU NHAP VAO'!E42 = \"\",\"\",'DU LIEU NHAP VAO'!E42)","v":""},""]
[{"$f":"IF(C44=\"\",\"\",MAX($A$6:A43)+ 1)","v":""},"",{"$f":"IF(ISERROR(duonglich(D44)),\"\",duonglich(D44))","v":""},{"$f":"IF('DU LIEU NHAP VAO'!B43=\"\",\"\",TEXT('DU LIEU NHAP VAO'!B43,\"dd/MM\")&\"/\"&'DU LIEU NHAP VAO'!$I$6)","v":""},{"$f":"IF('DU LIEU NHAP VAO'!C43 = \"\",\"\",'DU LIEU NHAP VAO'!C43)","v":""},{"$f":"IF('DU LIEU NHAP VAO'!D43 = \"\",\"\",'DU LIEU NHAP VAO'!D43)","v":""},{"$f":"IF('DU LIEU NHAP VAO'!E43 = \"\",\"\",'DU LIEU NHAP VAO'!E43)","v":""},""]
[{"$f":"IF(C45=\"\",\"\",MAX($A$6:A44)+ 1)","v":""},"",{"$f":"IF(ISERROR(duonglich(D45)),\"\",duonglich(D45))","v":""},{"$f":"IF('DU LIEU NHAP VAO'!B44=\"\",\"\",TEXT('DU LIEU NHAP VAO'!B44,\"dd/MM\")&\"/\"&'DU LIEU NHAP VAO'!$I$6)","v":""},{"$f":"IF('DU LIEU NHAP VAO'!C44 = \"\",\"\",'DU LIEU NHAP VAO'!C44)","v":""},{"$f":"IF('DU LIEU NHAP VAO'!D44 = \"\",\"\",'DU LIEU NHAP VAO'!D44)","v":""},{"$f":"IF('DU LIEU NHAP VAO'!E44 = \"\",\"\",'DU LIEU NHAP VAO'!E44)","v":""},""]
[{"$f":"IF(C46=\"\",\"\",MAX($A$6:A45)+ 1)","v":""},"",{"$f":"IF(ISERROR(duonglich(D46)),\"\",duonglich(D46))","v":""},{"$f":"IF('DU LIEU NHAP VAO'!B45=\"\",\"\",TEXT('DU LIEU NHAP VAO'!B45,\"dd/MM\")&\"/\"&'DU LIEU NHAP VAO'!$I$6)","v":""},{"$f":"IF('DU LIEU NHAP VAO'!C45 = \"\",\"\",'DU LIEU NHAP VAO'!C45)","v":""},{"$f":"IF('DU LIEU NHAP VAO'!D45 = \"\",\"\",'DU LIEU NHAP VAO'!D45)","v":""},{"$f":"IF('DU LIEU NHAP VAO'!E45 = \"\",\"\",'DU LIEU NHAP VAO'!E45)","v":""},""]
[{"$f":"IF(C47=\"\",\"\",MAX($A$6:A46)+ 1)","v":""},"",{"$f":"IF(ISERROR(duonglich(D47)),\"\",duonglich(D47))","v":""},{"$f":"IF('DU LIEU NHAP VAO'!B46=\"\",\"\",TEXT('DU LIEU NHAP VAO'!B46,\"dd/MM\")&\"/\"&'DU LIEU NHAP VAO'!$I$6)","v":""},{"$f":"IF('DU LIEU NHAP VAO'!C46 = \"\",\"\",'DU LIEU NHAP VAO'!C46)","v":""},{"$f":"IF('DU LIEU NHAP VAO'!D46 = \"\",\"\",'DU LIEU NHAP VAO'!D46)","v":""},{"$f":"IF('DU LIEU NHAP VAO'!E46 = \"\",\"\",'DU LIEU NHAP VAO'!E46)","v":""},""]
[{"$f":"IF(C48=\"\",\"\",MAX($A$6:A47)+ 1)","v":""},"",{"$f":"IF(ISERROR(duonglich(D48)),\"\",duonglich(D48))","v":""},{"$f":"IF('DU LIEU NHAP VAO'!B47=\"\",\"\",TEXT('DU LIEU NHAP VAO'!B47,\"dd/MM\")&\"/\"&'DU LIEU NHAP VAO'!$I$6)","v":""},{"$f":"IF('DU LIEU NHAP VAO'!C47 = \"\",\"\",'DU LIEU NHAP VAO'!C47)","v":""},{"$f":"IF('DU LIEU NHAP VAO'!D47 = \"\",\"\",'DU LIEU NHAP VAO'!D47)","v":""},{"$f":"IF('DU LIEU NHAP VAO'!E47 = \"\",\"\",'DU LIEU NHAP VAO'!E47)","v":""},""]
[{"$f":"IF(C49=\"\",\"\",MAX($A$6:A48)+ 1)","v":""},"",{"$f":"IF(ISERROR(duonglich(D49)),\"\",duonglich(D49))","v":""},{"$f":"IF('DU LIEU NHAP VAO'!B48=\"\",\"\",TEXT('DU LIEU NHAP VAO'!B48,\"dd/MM\")&\"/\"&'DU LIEU NHAP VAO'!$I$6)","v":""},{"$f":"IF('DU LIEU NHAP VAO'!C48 = \"\",\"\",'DU LIEU NHAP VAO'!C48)","v":""},{"$f":"IF('DU LIEU NHAP VAO'!D48 = \"\",\"\",'DU LIEU NHAP VAO'!D48)","v":""},{"$f":"IF('DU LIEU NHAP VAO'!E48 = \"\",\"\",'DU LIEU NHAP VAO'!E48)","v":""},""]
[{"$f":"IF(C50=\"\",\"\",MAX($A$6:A49)+ 1)","v":""},"",{"$f":"IF(ISERROR(duonglich(D50)),\"\",duonglich(D50))","v":""},{"$f":"IF('DU LIEU NHAP VAO'!B49=\"\",\"\",TEXT('DU LIEU NHAP VAO'!B49,\"dd/MM\")&\"/\"&'DU LIEU NHAP VAO'!$I$6)","v":""},{"$f":"IF('DU LIEU NHAP VAO'!C49 = \"\",\"\",'DU LIEU NHAP VAO'!C49)","v":""},{"$f":"IF('DU LIEU NHAP VAO'!D49 = \"\",\"\",'DU LIEU NHAP VAO'!D49)","v":""},{"$f":"IF('DU LIEU NHAP VAO'!E49 = \"\",\"\",'DU LIEU NHAP VAO'!E49)","v":""},""]
[{"$f":"IF(C51=\"\",\"\",MAX($A$6:A50)+ 1)","v":""},"",{"$f":"IF(ISERROR(duonglich(D51)),\"\",duonglich(D51))","v":""},{"$f":"IF('DU LIEU NHAP VAO'!B50=\"\",\"\",TEXT('DU LIEU NHAP VAO'!B50,\"dd/MM\")&\"/\"&'DU LIEU NHAP VAO'!$I$6)","v":""},{"$f":"IF('DU LIEU NHAP VAO'!C50 = \"\",\"\",'DU LIEU NHAP VAO'!C50)","v":""},{"$f":"IF('DU LIEU NHAP VAO'!D50 = \"\",\"\",'DU LIEU NHAP VAO'!D50)","v":""},{"$f":"IF('DU LIEU NHAP VAO'!E50 = \"\",\"\",'DU LIEU NHAP VAO'!E50)","v":""},""]
[{"$f":"IF(C52=\"\",\"\",MAX($A$6:A51)+ 1)","v":""},"",{"$f":"IF(ISERROR(duonglich(D52)),\"\",duonglich(D52))","v":""},{"$f":"IF('DU LIEU NHAP VAO'!B51=\"\",\"\",TEXT('DU LIEU NHAP VAO'!B51,\"dd/MM\")&\"/\"&'DU LIEU NHAP VAO'!$I$6)","v":""},{"$f":"IF('DU LIEU NHAP VAO'!C51 = \"\",\"\",'DU LIEU NHAP VAO'!C51)","v":""},{"$f":"IF('DU LIEU NHAP VAO'!D51 = \"\",\"\",'DU LIEU NHAP VAO'!D51)","v":""},{"$f":"IF('DU LIEU NHAP VAO'!E51 = \"\",\"\",'DU LIEU NHAP VAO'!E51)","v":""},""]
[{"$f":"IF(C53=\"\",\"\",MAX($A$6:A52)+ 1)","v":""},"",{"$f":"IF(ISERROR(duonglich(D53)),\"\",duonglich(D53))","v":""},{"$f":"IF('DU LIEU NHAP VAO'!B52=\"\",\"\",TEXT('DU LIEU NHAP VAO'!B52,\"dd/MM\")&\"/\"&'DU LIEU NHAP VAO'!$I$6)","v":""},{"$f":"IF('DU LIEU NHAP VAO'!C52 = \"\",\"\",'DU LIEU NHAP VAO'!C52)","v":""},{"$f":"IF('DU LIEU NHAP VAO'!D52 = \"\",\"\",'DU LIEU NHAP VAO'!D52)","v":""},{"$f":"IF('DU LIEU NHAP VAO'!E52 = \"\",\"\",'DU LIEU NHAP VAO'!E52)","v":""},""]
[{"$f":"IF(C54=\"\",\"\",MAX($A$6:A53)+ 1)","v":""},"",{"$f":"IF(ISERROR(duonglich(D54)),\"\",duonglich(D54))","v":""},{"$f":"IF('DU LIEU NHAP VAO'!B53=\"\",\"\",TEXT('DU LIEU NHAP VAO'!B53,\"dd/MM\")&\"/\"&'DU LIEU NHAP VAO'!$I$6)","v":""},{"$f":"IF('DU LIEU NHAP VAO'!C53 = \"\",\"\",'DU LIEU NHAP VAO'!C53)","v":""},{"$f":"IF('DU LIEU NHAP VAO'!D53 = \"\",\"\",'DU LIEU NHAP VAO'!D53)","v":""},{"$f":"IF('DU LIEU NHAP VAO'!E53 = \"\",\"\",'DU LIEU NHAP VAO'!E53)","v":""},""]
[{"$f":"IF(C55=\"\",\"\",MAX($A$6:A54)+ 1)","v":""},"",{"$f":"IF(ISERROR(duonglich(D55)),\"\",duonglich(D55))","v":""},{"$f":"IF('DU LIEU NHAP VAO'!B54=\"\",\"\",TEXT('DU LIEU NHAP VAO'!B54,\"dd/MM\")&\"/\"&'DU LIEU NHAP VAO'!$I$6)","v":""},{"$f":"IF('DU LIEU NHAP VAO'!C54 = \"\",\"\",'DU LIEU NHAP VAO'!C54)","v":""},{"$f":"IF('DU LIEU NHAP VAO'!D54 = \"\",\"\",'DU LIEU NHAP VAO'!D54)","v":""},{"$f":"IF('DU LIEU NHAP VAO'!E54 = \"\",\"\",'DU LIEU NHAP VAO'!E54)","v":""},""]
[{"$f":"IF(C56=\"\",\"\",MAX($A$6:A55)+ 1)","v":""},"",{"$f":"IF(ISERROR(duonglich(D56)),\"\",duonglich(D56))","v":""},{"$f":"IF('DU LIEU NHAP VAO'!B55=\"\",\"\",TEXT('DU LIEU NHAP VAO'!B55,\"dd/MM\")&\"/\"&'DU LIEU NHAP VAO'!$I$6)","v":""},{"$f":"IF('DU LIEU NHAP VAO'!C55 = \"\",\"\",'DU LIEU NHAP VAO'!C55)","v":""},{"$f":"IF('DU LIEU NHAP VAO'!D55 = \"\",\"\",'DU LIEU NHAP VAO'!D55)","v":""},{"$f":"IF('DU LIEU NHAP VAO'!E55 = \"\",\"\",'DU LIEU NHAP VAO'!E55)","v":""},""]
[{"$f":"IF(C57=\"\",\"\",MAX($A$6:A56)+ 1)","v":""},"",{"$f":"IF(ISERROR(duonglich(D57)),\"\",duonglich(D57))","v":""},{"$f":"IF('DU LIEU NHAP VAO'!B56=\"\",\"\",TEXT('DU LIEU NHAP VAO'!B56,\"dd/MM\")&\"/\"&'DU LIEU NHAP VAO'!$I$6)","v":""},{"$f":"IF('DU LIEU NHAP VAO'!C56 = \"\",\"\",'DU LIEU NHAP VAO'!C56)","v":""},{"$f":"IF('DU LIEU NHAP VAO'!D56 = \"\",\"\",'DU LIEU NHAP VAO'!D56)","v":""},{"$f":"IF('DU LIEU NHAP VAO'!E56 = \"\",\"\",'DU LIEU NHAP VAO'!E56)","v":""},""]
[{"$f":"IF(C58=\"\",\"\",MAX($A$6:A57)+ 1)","v":""},"",{"$f":"IF(ISERROR(duonglich(D58)),\"\",duonglich(D58))","v":""},{"$f":"IF('DU LIEU NHAP VAO'!B57=\"\",\"\",TEXT('DU LIEU NHAP VAO'!B57,\"dd/MM\")&\"/\"&'DU LIEU NHAP VAO'!$I$6)","v":""},{"$f":"IF('DU LIEU NHAP VAO'!C57 = \"\",\"\",'DU LIEU NHAP VAO'!C57)","v":""},{"$f":"IF('DU LIEU NHAP VAO'!D57 = \"\",\"\",'DU LIEU NHAP VAO'!D57)","v":""},{"$f":"IF('DU LIEU NHAP VAO'!E57 = \"\",\"\",'DU LIEU NHAP VAO'!E57)","v":""},""]
[{"$f":"IF(C59=\"\",\"\",MAX($A$6:A58)+ 1)","v":""},"",{"$f":"IF(ISERROR(duonglich(D59)),\"\",duonglich(D59))","v":""},{"$f":"IF('DU LIEU NHAP VAO'!B58=\"\",\"\",TEXT('DU LIEU NHAP VAO'!B58,\"dd/MM\")&\"/\"&'DU LIEU NHAP VAO'!$I$6)","v":""},{"$f":"IF('DU LIEU NHAP VAO'!C58 = \"\",\"\",'DU LIEU NHAP VAO'!C58)","v":""},{"$f":"IF('DU LIEU NHAP VAO'!D58 = \"\",\"\",'DU LIEU NHAP VAO'!D58)","v":""},{"$f":"IF('DU LIEU NHAP VAO'!E58 = \"\",\"\",'DU LIEU NHAP VAO'!E58)","v":""},""]
[{"$f":"IF(C60=\"\",\"\",MAX($A$6:A59)+ 1)","v":""},"",{"$f":"IF(ISERROR(duonglich(D60)),\"\",duonglich(D60))","v":""},{"$f":"IF('DU LIEU NHAP VAO'!B59=\"\",\"\",TEXT('DU LIEU NHAP VAO'!B59,\"dd/MM\")&\"/\"&'DU LIEU NHAP VAO'!$I$6)","v":""},{"$f":"IF('DU LIEU NHAP VAO'!C59 = \"\",\"\",'DU LIEU NHAP VAO'!C59)","v":""},{"$f":"IF('DU LIEU NHAP VAO'!D59 = \"\",\"\",'DU LIEU NHAP VAO'!D59)","v":""},{"$f":"IF('DU LIEU NHAP VAO'!E59 = \"\",\"\",'DU LIEU NHAP VAO'!E59)","v":""},""]
[{"$f":"IF(C61=\"\",\"\",MAX($A$6:A60)+ 1)","v":""},"",{"$f":"IF(ISERROR(duonglich(D61)),\"\",duonglich(D61))","v":""},{"$f":"IF('DU LIEU NHAP VAO'!B60=\"\",\"\",TEXT('DU LIEU NHAP VAO'!B60,\"dd/MM\")&\"/\"&'DU LIEU NHAP VAO'!$I$6)","v":""},{"$f":"IF('DU LIEU NHAP VAO'!C60 = \"\",\"\",'DU LIEU NHAP VAO'!C60)","v":""},{"$f":"IF('DU LIEU NHAP VAO'!D60 = \"\",\"\",'DU LIEU NHAP VAO'!D60)","v":""},{"$f":"IF('DU LIEU NHAP VAO'!E60 = \"\",\"\",'DU LIEU NHAP VAO'!E60)","v":""},""]
[{"$f":"IF(C62=\"\",\"\",MAX($A$6:A61)+ 1)","v":""},"",{"$f":"IF(ISERROR(duonglich(D62)),\"\",duonglich(D62))","v":""},{"$f":"IF('DU LIEU NHAP VAO'!B61=\"\",\"\",TEXT('DU LIEU NHAP VAO'!B61,\"dd/MM\")&\"/\"&'DU LIEU NHAP VAO'!$I$6)","v":""},{"$f":"IF('DU LIEU NHAP VAO'!C61 = \"\",\"\",'DU LIEU NHAP VAO'!C61)","v":""},{"$f":"IF('DU LIEU NHAP VAO'!D61 = \"\",\"\",'DU LIEU NHAP VAO'!D61)","v":""},{"$f":"IF('DU LIEU NHAP VAO'!E61 = \"\",\"\",'DU LIEU NHAP VAO'!E61)","v":""},""]
[{"$f":"IF(C63=\"\",\"\",MAX($A$6:A62)+ 1)","v":""},"",{"$f":"IF(ISERROR(duonglich(D63)),\"\",duonglich(D63))","v":""},{"$f":"IF('DU LIEU NHAP VAO'!B62=\"\",\"\",TEXT('DU LIEU NHAP VAO'!B62,\"dd/MM\")&\"/\"&'DU LIEU NHAP VAO'!$I$6)","v":""},{"$f":"IF('DU LIEU NHAP VAO'!C62 = \"\",\"\",'DU LIEU NHAP VAO'!C62)","v":""},{"$f":"IF('DU LIEU NHAP VAO'!D62 = \"\",\"\",'DU LIEU NHAP VAO'!D62)","v":""},{"$f":"IF('DU LIEU NHAP VAO'!E62 = \"\",\"\",'DU LIEU NHAP VAO'!E62)","v":""},""]
[{"$f":"IF(C64=\"\",\"\",MAX($A$6:A63)+ 1)","v":""},"",{"$f":"IF(ISERROR(duonglich(D64)),\"\",duonglich(D64))","v":""},{"$f":"IF('DU LIEU NHAP VAO'!B63=\"\",\"\",TEXT('DU LIEU NHAP VAO'!B63,\"dd/MM\")&\"/\"&'DU LIEU NHAP VAO'!$I$6)","v":""},{"$f":"IF('DU LIEU NHAP VAO'!C63 = \"\",\"\",'DU LIEU NHAP VAO'!C63)","v":""},{"$f":"IF('DU LIEU NHAP VAO'!D63 = \"\",\"\",'DU LIEU NHAP VAO'!D63)","v":""},{"$f":"IF('DU LIEU NHAP VAO'!E63 = \"\",\"\",'DU LIEU NHAP VAO'!E63)","v":""},""]
[{"$f":"IF(C65=\"\",\"\",MAX($A$6:A64)+ 1)","v":""},"",{"$f":"IF(ISERROR(duonglich(D65)),\"\",duonglich(D65))","v":""},{"$f":"IF('DU LIEU NHAP VAO'!B64=\"\",\"\",TEXT('DU LIEU NHAP VAO'!B64,\"dd/MM\")&\"/\"&'DU LIEU NHAP VAO'!$I$6)","v":""},{"$f":"IF('DU LIEU NHAP VAO'!C64 = \"\",\"\",'DU LIEU NHAP VAO'!C64)","v":""},{"$f":"IF('DU LIEU NHAP VAO'!D64 = \"\",\"\",'DU LIEU NHAP VAO'!D64)","v":""},{"$f":"IF('DU LIEU NHAP VAO'!E64 = \"\",\"\",'DU LIEU NHAP VAO'!E64)","v":""},""]
[{"$f":"IF(C66=\"\",\"\",MAX($A$6:A65)+ 1)","v":""},"",{"$f":"IF(ISERROR(duonglich(D66)),\"\",duonglich(D66))","v":""},{"$f":"IF('DU LIEU NHAP VAO'!B65=\"\",\"\",TEXT('DU LIEU NHAP VAO'!B65,\"dd/MM\")&\"/\"&'DU LIEU NHAP VAO'!$I$6)","v":""},{"$f":"IF('DU LIEU NHAP VAO'!C65 = \"\",\"\",'DU LIEU NHAP VAO'!C65)","v":""},{"$f":"IF('DU LIEU NHAP VAO'!D65 = \"\",\"\",'DU LIEU NHAP VAO'!D65)","v":""},{"$f":"IF('DU LIEU NHAP VAO'!E65 = \"\",\"\",'DU LIEU NHAP VAO'!E65)","v":""},""]
[{"$f":"IF(C67=\"\",\"\",MAX($A$6:A66)+ 1)","v":""},"",{"$f":"IF(ISERROR(duonglich(D67)),\"\",duonglich(D67))","v":""},{"$f":"IF('DU LIEU NHAP VAO'!B66=\"\",\"\",TEXT('DU LIEU NHAP VAO'!B66,\"dd/MM\")&\"/\"&'DU LIEU NHAP VAO'!$I$6)","v":""},{"$f":"IF('DU LIEU NHAP VAO'!C66 = \"\",\"\",'DU LIEU NHAP VAO'!C66)","v":""},{"$f":"IF('DU LIEU NHAP VAO'!D66 = \"\",\"\",'DU LIEU NHAP VAO'!D66)","v":""},{"$f":"IF('DU LIEU NHAP VAO'!E66 = \"\",\"\",'DU LIEU NHAP VAO'!E66)","v":""},""]
[{"$f":"IF(C68=\"\",\"\",MAX($A$6:A67)+ 1)","v":""},"",{"$f":"IF(ISERROR(duonglich(D68)),\"\",duonglich(D68))","v":""},{"$f":"IF('DU LIEU NHAP VAO'!B67=\"\",\"\",TEXT('DU LIEU NHAP VAO'!B67,\"dd/MM\")&\"/\"&'DU LIEU NHAP VAO'!$I$6)","v":""},{"$f":"IF('DU LIEU NHAP VAO'!C67 = \"\",\"\",'DU LIEU NHAP VAO'!C67)","v":""},{"$f":"IF('DU LIEU NHAP VAO'!D67 = \"\",\"\",'DU LIEU NHAP VAO'!D67)","v":""},{"$f":"IF('DU LIEU NHAP VAO'!E67 = \"\",\"\",'DU LIEU NHAP VAO'!E67)","v":""},""]
[{"$f":"IF(C69=\"\",\"\",MAX($A$6:A68)+ 1)","v":""},"",{"$f":"IF(ISERROR(duonglich(D69)),\"\",duonglich(D69))","v":""},{"$f":"IF('DU LIEU NHAP VAO'!B68=\"\",\"\",TEXT('DU LIEU NHAP VAO'!B68,\"dd/MM\")&\"/\"&'DU LIEU NHAP VAO'!$I$6)","v":""},{"$f":"IF('DU LIEU NHAP VAO'!C68 = \"\",\"\",'DU LIEU NHAP VAO'!C68)","v":""},{"$f":"IF('DU LIEU NHAP VAO'!D68 = \"\",\"\",'DU LIEU NHAP VAO'!D68)","v":""},{"$f":"IF('DU LIEU NHAP VAO'!E68 = \"\",\"\",'DU LIEU NHAP VAO'!E68)","v":""},""]
[{"$f":"IF(C70=\"\",\"\",MAX($A$6:A69)+ 1)","v":""},"",{"$f":"IF(ISERROR(duonglich(D70)),\"\",duonglich(D70))","v":""},{"$f":"IF('DU LIEU NHAP VAO'!B69=\"\",\"\",TEXT('DU LIEU NHAP VAO'!B69,\"dd/MM\")&\"/\"&'DU LIEU NHAP VAO'!$I$6)","v":""},{"$f":"IF('DU LIEU NHAP VAO'!C69 = \"\",\"\",'DU LIEU NHAP VAO'!C69)","v":""},{"$f":"IF('DU LIEU NHAP VAO'!D69 = \"\",\"\",'DU LIEU NHAP VAO'!D69)","v":""},{"$f":"IF('DU LIEU NHAP VAO'!E69 = \"\",\"\",'DU LIEU NHAP VAO'!E69)","v":""},""]
[{"$f":"IF(C71=\"\",\"\",MAX($A$6:A70)+ 1)","v":""},{"$f":"IF(C71=\"\",\"\",IF(WEEKDAY(C71,1)=1,\"CN\",\"T\"&WEEKDAY(C71,1)))","v":""},{"$f":"IF(ISERROR(duonglich(D71)),\"\",duonglich(D71))","v":""},{"$f":"IF('DU LIEU NHAP VAO'!B70=\"\",\"\",TEXT('DU LIEU NHAP VAO'!B70,\"dd/MM\")&\"/\"&'DU LIEU NHAP VAO'!$I$6)","v":""},{"$f":"IF('DU LIEU NHAP VAO'!C70 = \"\",\"\",'DU LIEU NHAP VAO'!C70)","v":""},{"$f":"IF('DU LIEU NHAP VAO'!D70 = \"\",\"\",'DU LIEU NHAP VAO'!D70)","v":""},{"$f":"IF('DU LIEU NHAP VAO'!E70 = \"\",\"\",'DU LIEU NHAP VAO'!E70)","v":""},{"$f":"IF(E71=\"\",\"\",IF(AND(ABS(DAYS360($N$2,C71))<>0, YEAR(C71) = YEAR(NOW()),MONTH(C71) < MONTH(NOW())),\"Đã qua \"&ABS(DAYS360(C71,$N$2))&\" ngày\",\"Còn \"&ABS(DAYS360(C71,$N$2))&\" ngày\"))","v":""}]
[{"$f":"IF(C72=\"\",\"\",MAX($A$6:A71)+ 1)","v":""},"",{"$f":"IF(ISERROR(duonglich(D72)),\"\",duonglich(D72))","v":""},{"$f":"IF('DU LIEU NHAP VAO'!B71=\"\",\"\",TEXT('DU LIEU NHAP VAO'!B71,\"dd/MM\")&\"/\"&'DU LIEU NHAP VAO'!$I$6)","v":""},{"$f":"IF('DU LIEU NHAP VAO'!C71 = \"\",\"\",'DU LIEU NHAP VAO'!C71)","v":""},{"$f":"IF('DU LIEU NHAP VAO'!D71 = \"\",\"\",'DU LIEU NHAP VAO'!D71)","v":""},{"$f":"IF('DU LIEU NHAP VAO'!E71 = \"\",\"\",'DU LIEU NHAP VAO'!E71)","v":""},""]
[{"$f":"IF(C73=\"\",\"\",MAX($A$6:A72)+ 1)","v":""},"",{"$f":"IF(ISERROR(duonglich(D73)),\"\",duonglich(D73))","v":""},{"$f":"IF('DU LIEU NHAP VAO'!B72=\"\",\"\",TEXT('DU LIEU NHAP VAO'!B72,\"dd/MM\")&\"/\"&'DU LIEU NHAP VAO'!$I$6)","v":""},{"$f":"IF('DU LIEU NHAP VAO'!C72 = \"\",\"\",'DU LIEU NHAP VAO'!C72)","v":""},{"$f":"IF('DU LIEU NHAP VAO'!D72 = \"\",\"\",'DU LIEU NHAP VAO'!D72)","v":""},{"$f":"IF('DU LIEU NHAP VAO'!E72 = \"\",\"\",'DU LIEU NHAP VAO'!E72)","v":""},""]
[{"$f":"IF(C74=\"\",\"\",MAX($A$6:A73)+ 1)","v":""},"",{"$f":"IF(ISERROR(duonglich(D74)),\"\",duonglich(D74))","v":""},{"$f":"IF('DU LIEU NHAP VAO'!B73=\"\",\"\",TEXT('DU LIEU NHAP VAO'!B73,\"dd/MM\")&\"/\"&'DU LIEU NHAP VAO'!$I$6)","v":""},{"$f":"IF('DU LIEU NHAP VAO'!C73 = \"\",\"\",'DU LIEU NHAP VAO'!C73)","v":""},{"$f":"IF('DU LIEU NHAP VAO'!D73 = \"\",\"\",'DU LIEU NHAP VAO'!D73)","v":""},{"$f":"IF('DU LIEU NHAP VAO'!E73 = \"\",\"\",'DU LIEU NHAP VAO'!E73)","v":""},""]
[{"$f":"IF(C75=\"\",\"\",MAX($A$6:A74)+ 1)","v":""},"",{"$f":"IF(ISERROR(duonglich(D75)),\"\",duonglich(D75))","v":""},{"$f":"IF('DU LIEU NHAP VAO'!B74=\"\",\"\",TEXT('DU LIEU NHAP VAO'!B74,\"dd/MM\")&\"/\"&'DU LIEU NHAP VAO'!$I$6)","v":""},{"$f":"IF('DU LIEU NHAP VAO'!C74 = \"\",\"\",'DU LIEU NHAP VAO'!C74)","v":""},{"$f":"IF('DU LIEU NHAP VAO'!D74 = \"\",\"\",'DU LIEU NHAP VAO'!D74)","v":""},{"$f":"IF('DU LIEU NHAP VAO'!E74 = \"\",\"\",'DU LIEU NHAP VAO'!E74)","v":""},""]
[{"$f":"IF(C76=\"\",\"\",MAX($A$6:A75)+ 1)","v":""},"",{"$f":"IF(ISERROR(duonglich(D76)),\"\",duonglich(D76))","v":""},{"$f":"IF('DU LIEU NHAP VAO'!B75=\"\",\"\",TEXT('DU LIEU NHAP VAO'!B75,\"dd/MM\")&\"/\"&'DU LIEU NHAP VAO'!$I$6)","v":""},{"$f":"IF('DU LIEU NHAP VAO'!C75 = \"\",\"\",'DU LIEU NHAP VAO'!C75)","v":""},{"$f":"IF('DU LIEU NHAP VAO'!D75 = \"\",\"\",'DU LIEU NHAP VAO'!D75)","v":""},{"$f":"IF('DU LIEU NHAP VAO'!E75 = \"\",\"\",'DU LIEU NHAP VAO'!E75)","v":""},""]
[{"$f":"IF(C77=\"\",\"\",MAX($A$6:A76)+ 1)","v":""},"",{"$f":"IF(ISERROR(duonglich(D77)),\"\",duonglich(D77))","v":""},{"$f":"IF('DU LIEU NHAP VAO'!B76=\"\",\"\",TEXT('DU LIEU NHAP VAO'!B76,\"dd/MM\")&\"/\"&'DU LIEU NHAP VAO'!$I$6)","v":""},{"$f":"IF('DU LIEU NHAP VAO'!C76 = \"\",\"\",'DU LIEU NHAP VAO'!C76)","v":""},{"$f":"IF('DU LIEU NHAP VAO'!D76 = \"\",\"\",'DU LIEU NHAP VAO'!D76)","v":""},{"$f":"IF('DU LIEU NHAP VAO'!E76 = \"\",\"\",'DU LIEU NHAP VAO'!E76)","v":""},""]
[{"$f":"IF(C78=\"\",\"\",MAX($A$6:A77)+ 1)","v":""},"",{"$f":"IF(ISERROR(duonglich(D78)),\"\",duonglich(D78))","v":""},{"$f":"IF('DU LIEU NHAP VAO'!B77=\"\",\"\",TEXT('DU LIEU NHAP VAO'!B77,\"dd/MM\")&\"/\"&'DU LIEU NHAP VAO'!$I$6)","v":""},{"$f":"IF('DU LIEU NHAP VAO'!C77 = \"\",\"\",'DU LIEU NHAP VAO'!C77)","v":""},{"$f":"IF('DU LIEU NHAP VAO'!D77 = \"\",\"\",'DU LIEU NHAP VAO'!D77)","v":""},{"$f":"IF('DU LIEU NHAP VAO'!E77 = \"\",\"\",'DU LIEU NHAP VAO'!E77)","v":""},""]
[{"$f":"IF(C79=\"\",\"\",MAX($A$6:A78)+ 1)","v":""},"",{"$f":"IF(ISERROR(duonglich(D79)),\"\",duonglich(D79))","v":""},{"$f":"IF('DU LIEU NHAP VAO'!B78=\"\",\"\",TEXT('DU LIEU NHAP VAO'!B78,\"dd/MM\")&\"/\"&'DU LIEU NHAP VAO'!$I$6)","v":""},{"$f":"IF('DU LIEU NHAP VAO'!C78 = \"\",\"\",'DU LIEU NHAP VAO'!C78)","v":""},{"$f":"IF('DU LIEU NHAP VAO'!D78 = \"\",\"\",'DU LIEU NHAP VAO'!D78)","v":""},{"$f":"IF('DU LIEU NHAP VAO'!E78 = \"\",\"\",'DU LIEU NHAP VAO'!E78)","v":""},""]
[{"$f":"IF(C80=\"\",\"\",MAX($A$6:A79)+ 1)","v":""},"",{"$f":"IF(ISERROR(duonglich(D80)),\"\",duonglich(D80))","v":""},{"$f":"IF('DU LIEU NHAP VAO'!B79=\"\",\"\",TEXT('DU LIEU NHAP VAO'!B79,\"dd/MM\")&\"/\"&'DU LIEU NHAP VAO'!$I$6)","v":""},{"$f":"IF('DU LIEU NHAP VAO'!C79 = \"\",\"\",'DU LIEU NHAP VAO'!C79)","v":""},{"$f":"IF('DU LIEU NHAP VAO'!D79 = \"\",\"\",'DU LIEU NHAP VAO'!D79)","v":""},{"$f":"IF('DU LIEU NHAP VAO'!E79 = \"\",\"\",'DU LIEU NHAP VAO'!E79)","v":""},""]
[{"$f":"IF(C81=\"\",\"\",MAX($A$6:A80)+ 1)","v":""},"",{"$f":"IF(ISERROR(duonglich(D81)),\"\",duonglich(D81))","v":""},{"$f":"IF('DU LIEU NHAP VAO'!B80=\"\",\"\",TEXT('DU LIEU NHAP VAO'!B80,\"dd/MM\")&\"/\"&'DU LIEU NHAP VAO'!$I$6)","v":""},{"$f":"IF('DU LIEU NHAP VAO'!C80 = \"\",\"\",'DU LIEU NHAP VAO'!C80)","v":""},{"$f":"IF('DU LIEU NHAP VAO'!D80 = \"\",\"\",'DU LIEU NHAP VAO'!D80)","v":""},{"$f":"IF('DU LIEU NHAP VAO'!E80 = \"\",\"\",'DU LIEU NHAP VAO'!E80)","v":""},""]
[{"$f":"IF(C82=\"\",\"\",MAX($A$6:A81)+ 1)","v":""},"",{"$f":"IF(ISERROR(duonglich(D82)),\"\",duonglich(D82))","v":""},{"$f":"IF('DU LIEU NHAP VAO'!B81=\"\",\"\",TEXT('DU LIEU NHAP VAO'!B81,\"dd/MM\")&\"/\"&'DU LIEU NHAP VAO'!$I$6)","v":""},{"$f":"IF('DU LIEU NHAP VAO'!C81 = \"\",\"\",'DU LIEU NHAP VAO'!C81)","v":""},{"$f":"IF('DU LIEU NHAP VAO'!D81 = \"\",\"\",'DU LIEU NHAP VAO'!D81)","v":""},{"$f":"IF('DU LIEU NHAP VAO'!E81 = \"\",\"\",'DU LIEU NHAP VAO'!E81)","v":""},""]
[{"$f":"IF(C83=\"\",\"\",MAX($A$6:A82)+ 1)","v":""},"",{"$f":"IF(ISERROR(duonglich(D83)),\"\",duonglich(D83))","v":""},{"$f":"IF('DU LIEU NHAP VAO'!B82=\"\",\"\",TEXT('DU LIEU NHAP VAO'!B82,\"dd/MM\")&\"/\"&'DU LIEU NHAP VAO'!$I$6)","v":""},{"$f":"IF('DU LIEU NHAP VAO'!C82 = \"\",\"\",'DU LIEU NHAP VAO'!C82)","v":""},{"$f":"IF('DU LIEU NHAP VAO'!D82 = \"\",\"\",'DU LIEU NHAP VAO'!D82)","v":""},{"$f":"IF('DU LIEU NHAP VAO'!E82 = \"\",\"\",'DU LIEU NHAP VAO'!E82)","v":""},""]
[{"$f":"IF(C84=\"\",\"\",MAX($A$6:A83)+ 1)","v":""},"",{"$f":"IF(ISERROR(duonglich(D84)),\"\",duonglich(D84))","v":""},{"$f":"IF('DU LIEU NHAP VAO'!B83=\"\",\"\",TEXT('DU LIEU NHAP VAO'!B83,\"dd/MM\")&\"/\"&'DU LIEU NHAP VAO'!$I$6)","v":""},{"$f":"IF('DU LIEU NHAP VAO'!C83 = \"\",\"\",'DU LIEU NHAP VAO'!C83)","v":""},{"$f":"IF('DU LIEU NHAP VAO'!D83 = \"\",\"\",'DU LIEU NHAP VAO'!D83)","v":""},{"$f":"IF('DU LIEU NHAP VAO'!E83 = \"\",\"\",'DU LIEU NHAP VAO'!E83)","v":""},""]
[{"$f":"IF(C85=\"\",\"\",MAX($A$6:A84)+ 1)","v":""},"",{"$f":"IF(ISERROR(duonglich(D85)),\"\",duonglich(D85))","v":""},{"$f":"IF('DU LIEU NHAP VAO'!B84=\"\",\"\",TEXT('DU LIEU NHAP VAO'!B84,\"dd/MM\")&\"/\"&'DU LIEU NHAP VAO'!$I$6)","v":""},{"$f":"IF('DU LIEU NHAP VAO'!C84 = \"\",\"\",'DU LIEU NHAP VAO'!C84)","v":""},{"$f":"IF('DU LIEU NHAP VAO'!D84 = \"\",\"\",'DU LIEU NHAP VAO'!D84)","v":""},{"$f":"IF('DU LIEU NHAP VAO'!E84 = \"\",\"\",'DU LIEU NHAP VAO'!E84)","v":""},""]
[{"$f":"IF(C86=\"\",\"\",MAX($A$6:A85)+ 1)","v":""},"",{"$f":"IF(ISERROR(duonglich(D86)),\"\",duonglich(D86))","v":""},{"$f":"IF('DU LIEU NHAP VAO'!B85=\"\",\"\",TEXT('DU LIEU NHAP VAO'!B85,\"dd/MM\")&\"/\"&'DU LIEU NHAP VAO'!$I$6)","v":""},{"$f":"IF('DU LIEU NHAP VAO'!C85 = \"\",\"\",'DU LIEU NHAP VAO'!C85)","v":""},{"$f":"IF('DU LIEU NHAP VAO'!D85 = \"\",\"\",'DU LIEU NHAP VAO'!D85)","v":""},{"$f":"IF('DU LIEU NHAP VAO'!E85 = \"\",\"\",'DU LIEU NHAP VAO'!E85)","v":""},""]
[{"$f":"IF(C87=\"\",\"\",MAX($A$6:A86)+ 1)","v":""},"",{"$f":"IF(ISERROR(duonglich(D87)),\"\",duonglich(D87))","v":""},{"$f":"IF('DU LIEU NHAP VAO'!B86=\"\",\"\",TEXT('DU LIEU NHAP VAO'!B86,\"dd/MM\")&\"/\"&'DU LIEU NHAP VAO'!$I$6)","v":""},{"$f":"IF('DU LIEU NHAP VAO'!C86 = \"\",\"\",'DU LIEU NHAP VAO'!C86)","v":""},{"$f":"IF('DU LIEU NHAP VAO'!D86 = \"\",\"\",'DU LIEU NHAP VAO'!D86)","v":""},{"$f":"IF('DU LIEU NHAP VAO'!E86 = \"\",\"\",'DU LIEU NHAP VAO'!E86)","v":""},""]
[{"$f":"IF(C88=\"\",\"\",MAX($A$6:A87)+ 1)","v":""},"",{"$f":"IF(ISERROR(duonglich(D88)),\"\",duonglich(D88))","v":""},{"$f":"IF('DU LIEU NHAP VAO'!B87=\"\",\"\",TEXT('DU LIEU NHAP VAO'!B87,\"dd/MM\")&\"/\"&'DU LIEU NHAP VAO'!$I$6)","v":""},{"$f":"IF('DU LIEU NHAP VAO'!C87 = \"\",\"\",'DU LIEU NHAP VAO'!C87)","v":""},{"$f":"IF('DU LIEU NHAP VAO'!D87 = \"\",\"\",'DU LIEU NHAP VAO'!D87)","v":""},{"$f":"IF('DU LIEU NHAP VAO'!E87 = \"\",\"\",'DU LIEU NHAP VAO'!E87)","v":""},""]
[{"$f":"IF(C89=\"\",\"\",MAX($A$6:A88)+ 1)","v":""},"",{"$f":"IF(ISERROR(duonglich(D89)),\"\",duonglich(D89))","v":""},{"$f":"IF('DU LIEU NHAP VAO'!B88=\"\",\"\",TEXT('DU LIEU NHAP VAO'!B88,\"dd/MM\")&\"/\"&'DU LIEU NHAP VAO'!$I$6)","v":""},{"$f":"IF('DU LIEU NHAP VAO'!C88 = \"\",\"\",'DU LIEU NHAP VAO'!C88)","v":""},{"$f":"IF('DU LIEU NHAP VAO'!D88 = \"\",\"\",'DU LIEU NHAP VAO'!D88)","v":""},{"$f":"IF('DU LIEU NHAP VAO'!E88 = \"\",\"\",'DU LIEU NHAP VAO'!E88)","v":""},""]
[{"$f":"IF(C90=\"\",\"\",MAX($A$6:A89)+ 1)","v":""},"",{"$f":"IF(ISERROR(duonglich(D90)),\"\",duonglich(D90))","v":""},{"$f":"IF('DU LIEU NHAP VAO'!B89=\"\",\"\",TEXT('DU LIEU NHAP VAO'!B89,\"dd/MM\")&\"/\"&'DU LIEU NHAP VAO'!$I$6)","v":""},{"$f":"IF('DU LIEU NHAP VAO'!C89 = \"\",\"\",'DU LIEU NHAP VAO'!C89)","v":""},{"$f":"IF('DU LIEU NHAP VAO'!D89 = \"\",\"\",'DU LIEU NHAP VAO'!D89)","v":""},{"$f":"IF('DU LIEU NHAP VAO'!E89 = \"\",\"\",'DU LIEU NHAP VAO'!E89)","v":""},""]
[{"$f":"IF(C91=\"\",\"\",MAX($A$6:A90)+ 1)","v":""},"",{"$f":"IF(ISERROR(duonglich(D91)),\"\",duonglich(D91))","v":""},{"$f":"IF('DU LIEU NHAP VAO'!B90=\"\",\"\",TEXT('DU LIEU NHAP VAO'!B90,\"dd/MM\")&\"/\"&'DU LIEU NHAP VAO'!$I$6)","v":""},{"$f":"IF('DU LIEU NHAP VAO'!C90 = \"\",\"\",'DU LIEU NHAP VAO'!C90)","v":""},{"$f":"IF('DU LIEU NHAP VAO'!D90 = \"\",\"\",'DU LIEU NHAP VAO'!D90)","v":""},{"$f":"IF('DU LIEU NHAP VAO'!E90 = \"\",\"\",'DU LIEU NHAP VAO'!E90)","v":""},""]
[{"$f":"IF(C92=\"\",\"\",MAX($A$6:A91)+ 1)","v":""},"",{"$f":"IF(ISERROR(duonglich(D92)),\"\",duonglich(D92))","v":""},{"$f":"IF('DU LIEU NHAP VAO'!B91=\"\",\"\",TEXT('DU LIEU NHAP VAO'!B91,\"dd/MM\")&\"/\"&'DU LIEU NHAP VAO'!$I$6)","v":""},{"$f":"IF('DU LIEU NHAP VAO'!C91 = \"\",\"\",'DU LIEU NHAP VAO'!C91)","v":""},{"$f":"IF('DU LIEU NHAP VAO'!D91 = \"\",\"\",'DU LIEU NHAP VAO'!D91)","v":""},{"$f":"IF('DU LIEU NHAP VAO'!E91 = \"\",\"\",'DU LIEU NHAP VAO'!E91)","v":""},""]
[{"$f":"IF(C93=\"\",\"\",MAX($A$6:A92)+ 1)","v":""},"",{"$f":"IF(ISERROR(duonglich(D93)),\"\",duonglich(D93))","v":""},{"$f":"IF('DU LIEU NHAP VAO'!B92=\"\",\"\",TEXT('DU LIEU NHAP VAO'!B92,\"dd/MM\")&\"/\"&'DU LIEU NHAP VAO'!$I$6)","v":""},{"$f":"IF('DU LIEU NHAP VAO'!C92 = \"\",\"\",'DU LIEU NHAP VAO'!C92)","v":""},{"$f":"IF('DU LIEU NHAP VAO'!D92 = \"\",\"\",'DU LIEU NHAP VAO'!D92)","v":""},{"$f":"IF('DU LIEU NHAP VAO'!E92 = \"\",\"\",'DU LIEU NHAP VAO'!E92)","v":""},""]
[{"$f":"IF(C94=\"\",\"\",MAX($A$6:A93)+ 1)","v":""},"",{"$f":"IF(ISERROR(duonglich(D94)),\"\",duonglich(D94))","v":""},{"$f":"IF('DU LIEU NHAP VAO'!B93=\"\",\"\",TEXT('DU LIEU NHAP VAO'!B93,\"dd/MM\")&\"/\"&'DU LIEU NHAP VAO'!$I$6)","v":""},{"$f":"IF('DU LIEU NHAP VAO'!C93 = \"\",\"\",'DU LIEU NHAP VAO'!C93)","v":""},{"$f":"IF('DU LIEU NHAP VAO'!D93 = \"\",\"\",'DU LIEU NHAP VAO'!D93)","v":""},{"$f":"IF('DU LIEU NHAP VAO'!E93 = \"\",\"\",'DU LIEU NHAP VAO'!E93)","v":""},""]
[{"$f":"IF(C95=\"\",\"\",MAX($A$6:A94)+ 1)","v":""},"",{"$f":"IF(ISERROR(duonglich(D95)),\"\",duonglich(D95))","v":""},{"$f":"IF('DU LIEU NHAP VAO'!B94=\"\",\"\",TEXT('DU LIEU NHAP VAO'!B94,\"dd/MM\")&\"/\"&'DU LIEU NHAP VAO'!$I$6)","v":""},{"$f":"IF('DU LIEU NHAP VAO'!C94 = \"\",\"\",'DU LIEU NHAP VAO'!C94)","v":""},{"$f":"IF('DU LIEU NHAP VAO'!D94 = \"\",\"\",'DU LIEU NHAP VAO'!D94)","v":""},{"$f":"IF('DU LIEU NHAP VAO'!E94 = \"\",\"\",'DU LIEU NHAP VAO'!E94)","v":""},""]
[{"$f":"IF(C96=\"\",\"\",MAX($A$6:A95)+ 1)","v":""},"",{"$f":"IF(ISERROR(duonglich(D96)),\"\",duonglich(D96))","v":""},{"$f":"IF('DU LIEU NHAP VAO'!B95=\"\",\"\",TEXT('DU LIEU NHAP VAO'!B95,\"dd/MM\")&\"/\"&'DU LIEU NHAP VAO'!$I$6)","v":""},{"$f":"IF('DU LIEU NHAP VAO'!C95 = \"\",\"\",'DU LIEU NHAP VAO'!C95)","v":""},{"$f":"IF('DU LIEU NHAP VAO'!D95 = \"\",\"\",'DU LIEU NHAP VAO'!D95)","v":""},{"$f":"IF('DU LIEU NHAP VAO'!E95 = \"\",\"\",'DU LIEU NHAP VAO'!E95)","v":""},""]
[{"$f":"IF(C97=\"\",\"\",MAX($A$6:A96)+ 1)","v":""},"",{"$f":"IF(ISERROR(duonglich(D97)),\"\",duonglich(D97))","v":""},{"$f":"IF('DU LIEU NHAP VAO'!B96=\"\",\"\",TEXT('DU LIEU NHAP VAO'!B96,\"dd/MM\")&\"/\"&'DU LIEU NHAP VAO'!$I$6)","v":""},{"$f":"IF('DU LIEU NHAP VAO'!C96 = \"\",\"\",'DU LIEU NHAP VAO'!C96)","v":""},{"$f":"IF('DU LIEU NHAP VAO'!D96 = \"\",\"\",'DU LIEU NHAP VAO'!D96)","v":""},{"$f":"IF('DU LIEU NHAP VAO'!E96 = \"\",\"\",'DU LIEU NHAP VAO'!E96)","v":""},""]
[{"$f":"IF(C98=\"\",\"\",MAX($A$6:A97)+ 1)","v":""},"",{"$f":"IF(ISERROR(duonglich(D98)),\"\",duonglich(D98))","v":""},{"$f":"IF('DU LIEU NHAP VAO'!B97=\"\",\"\",TEXT('DU LIEU NHAP VAO'!B97,\"dd/MM\")&\"/\"&'DU LIEU NHAP VAO'!$I$6)","v":""},{"$f":"IF('DU LIEU NHAP VAO'!C97 = \"\",\"\",'DU LIEU NHAP VAO'!C97)","v":""},{"$f":"IF('DU LIEU NHAP VAO'!D97 = \"\",\"\",'DU LIEU NHAP VAO'!D97)","v":""},{"$f":"IF('DU LIEU NHAP VAO'!E97 = \"\",\"\",'DU LIEU NHAP VAO'!E97)","v":""},""]
[{"$f":"IF(C99=\"\",\"\",MAX($A$6:A98)+ 1)","v":""},"",{"$f":"IF(ISERROR(duonglich(D99)),\"\",duonglich(D99))","v":""},{"$f":"IF('DU LIEU NHAP VAO'!B98=\"\",\"\",TEXT('DU LIEU NHAP VAO'!B98,\"dd/MM\")&\"/\"&'DU LIEU NHAP VAO'!$I$6)","v":""},{"$f":"IF('DU LIEU NHAP VAO'!C98 = \"\",\"\",'DU LIEU NHAP VAO'!C98)","v":""},{"$f":"IF('DU LIEU NHAP VAO'!D98 = \"\",\"\",'DU LIEU NHAP VAO'!D98)","v":""},{"$f":"IF('DU LIEU NHAP VAO'!E98 = \"\",\"\",'DU LIEU NHAP VAO'!E98)","v":""},""]
[{"$f":"IF(C100=\"\",\"\",MAX($A$6:A99)+ 1)","v":""},"",{"$f":"IF(ISERROR(duonglich(D100)),\"\",duonglich(D100))","v":""},{"$f":"IF('DU LIEU NHAP VAO'!B99=\"\",\"\",TEXT('DU LIEU NHAP VAO'!B99,\"dd/MM\")&\"/\"&'DU LIEU NHAP VAO'!$I$6)","v":""},{"$f":"IF('DU LIEU NHAP VAO'!C99 = \"\",\"\",'DU LIEU NHAP VAO'!C99)","v":""},{"$f":"IF('DU LIEU NHAP VAO'!D99 = \"\",\"\",'DU LIEU NHAP VAO'!D99)","v":""},{"$f":"IF('DU LIEU NHAP VAO'!E99 = \"\",\"\",'DU LIEU NHAP VAO'!E99)","v":""},""]
[{"$f":"IF(C101=\"\",\"\",MAX($A$6:A100)+ 1)","v":""},"",{"$f":"IF(ISERROR(duonglich(D101)),\"\",duonglich(D101))","v":""},{"$f":"IF('DU LIEU NHAP VAO'!B100=\"\",\"\",TEXT('DU LIEU NHAP VAO'!B100,\"dd/MM\")&\"/\"&'DU LIEU NHAP VAO'!$I$6)","v":""},{"$f":"IF('DU LIEU NHAP VAO'!C100 = \"\",\"\",'DU LIEU NHAP VAO'!C100)","v":""},{"$f":"IF('DU LIEU NHAP VAO'!D100 = \"\",\"\",'DU LIEU NHAP VAO'!D100)","v":""},{"$f":"IF('DU LIEU NHAP VAO'!E100 = \"\",\"\",'DU LIEU NHAP VAO'!E100)","v":""},""]
[{"$f":"IF(C102=\"\",\"\",MAX($A$6:A101)+ 1)","v":""},"",{"$f":"IF(ISERROR(duonglich(D102)),\"\",duonglich(D102))","v":""},{"$f":"IF('DU LIEU NHAP VAO'!B101=\"\",\"\",TEXT('DU LIEU NHAP VAO'!B101,\"dd/MM\")&\"/\"&'DU LIEU NHAP VAO'!$I$6)","v":""},{"$f":"IF('DU LIEU NHAP VAO'!C101 = \"\",\"\",'DU LIEU NHAP VAO'!C101)","v":""},{"$f":"IF('DU LIEU NHAP VAO'!D101 = \"\",\"\",'DU LIEU NHAP VAO'!D101)","v":""},{"$f":"IF('DU LIEU NHAP VAO'!E101 = \"\",\"\",'DU LIEU NHAP VAO'!E101)","v":""},""]
[{"$f":"IF(C103=\"\",\"\",MAX($A$6:A102)+ 1)","v":""},"",{"$f":"IF(ISERROR(duonglich(D103)),\"\",duonglich(D103))","v":""},{"$f":"IF('DU LIEU NHAP VAO'!B102=\"\",\"\",TEXT('DU LIEU NHAP VAO'!B102,\"dd/MM\")&\"/\"&'DU LIEU NHAP VAO'!$I$6)","v":""},{"$f":"IF('DU LIEU NHAP VAO'!C102 = \"\",\"\",'DU LIEU NHAP VAO'!C102)","v":""},{"$f":"IF('DU LIEU NHAP VAO'!D102 = \"\",\"\",'DU LIEU NHAP VAO'!D102)","v":""},{"$f":"IF('DU LIEU NHAP VAO'!E102 = \"\",\"\",'DU LIEU NHAP VAO'!E102)","v":""},""]
[{"$f":"IF(C104=\"\",\"\",MAX($A$6:A103)+ 1)","v":""},"",{"$f":"IF(ISERROR(duonglich(D104)),\"\",duonglich(D104))","v":""},{"$f":"IF('DU LIEU NHAP VAO'!B103=\"\",\"\",TEXT('DU LIEU NHAP VAO'!B103,\"dd/MM\")&\"/\"&'DU LIEU NHAP VAO'!$I$6)","v":""},{"$f":"IF('DU LIEU NHAP VAO'!C103 = \"\",\"\",'DU LIEU NHAP VAO'!C103)","v":""},{"$f":"IF('DU LIEU NHAP VAO'!D103 = \"\",\"\",'DU LIEU NHAP VAO'!D103)","v":""},{"$f":"IF('DU LIEU NHAP VAO'!E103 = \"\",\"\",'DU LIEU NHAP VAO'!E103)","v":""},""]
[{"$f":"IF(C105=\"\",\"\",MAX($A$6:A104)+ 1)","v":""},"",{"$f":"IF(ISERROR(duonglich(D105)),\"\",duonglich(D105))","v":""},{"$f":"IF('DU LIEU NHAP VAO'!B104=\"\",\"\",TEXT('DU LIEU NHAP VAO'!B104,\"dd/MM\")&\"/\"&'DU LIEU NHAP VAO'!$I$6)","v":""},{"$f":"IF('DU LIEU NHAP VAO'!C104 = \"\",\"\",'DU LIEU NHAP VAO'!C104)","v":""},{"$f":"IF('DU LIEU NHAP VAO'!D104 = \"\",\"\",'DU LIEU NHAP VAO'!D104)","v":""},{"$f":"IF('DU LIEU NHAP VAO'!E104 = \"\",\"\",'DU LIEU NHAP VAO'!E104)","v":""},""]
[{"$f":"IF(C106=\"\",\"\",MAX($A$6:A105)+ 1)","v":""},"",{"$f":"IF(ISERROR(duonglich(D106)),\"\",duonglich(D106))","v":""},{"$f":"IF('DU LIEU NHAP VAO'!B105=\"\",\"\",TEXT('DU LIEU NHAP VAO'!B105,\"dd/MM\")&\"/\"&'DU LIEU NHAP VAO'!$I$6)","v":""},{"$f":"IF('DU LIEU NHAP VAO'!C105 = \"\",\"\",'DU LIEU NHAP VAO'!C105)","v":""},{"$f":"IF('DU LIEU NHAP VAO'!D105 = \"\",\"\",'DU LIEU NHAP VAO'!D105)","v":""},{"$f":"IF('DU LIEU NHAP VAO'!E105 = \"\",\"\",'DU LIEU NHAP VAO'!E105)","v":""},""]
[{"$f":"IF(C107=\"\",\"\",MAX($A$6:A106)+ 1)","v":""},"",{"$f":"IF(ISERROR(duonglich(D107)),\"\",duonglich(D107))","v":""},{"$f":"IF('DU LIEU NHAP VAO'!B106=\"\",\"\",TEXT('DU LIEU NHAP VAO'!B106,\"dd/MM\")&\"/\"&'DU LIEU NHAP VAO'!$I$6)","v":""},{"$f":"IF('DU LIEU NHAP VAO'!C106 = \"\",\"\",'DU LIEU NHAP VAO'!C106)","v":""},{"$f":"IF('DU LIEU NHAP VAO'!D106 = \"\",\"\",'DU LIEU NHAP VAO'!D106)","v":""},{"$f":"IF('DU LIEU NHAP VAO'!E106 = \"\",\"\",'DU LIEU NHAP VAO'!E106)","v":""},""]
[{"$f":"IF(C108=\"\",\"\",MAX($A$6:A107)+ 1)","v":""},"",{"$f":"IF(ISERROR(duonglich(D108)),\"\",duonglich(D108))","v":""},{"$f":"IF('DU LIEU NHAP VAO'!B107=\"\",\"\",TEXT('DU LIEU NHAP VAO'!B107,\"dd/MM\")&\"/\"&'DU LIEU NHAP VAO'!$I$6)","v":""},{"$f":"IF('DU LIEU NHAP VAO'!C107 = \"\",\"\",'DU LIEU NHAP VAO'!C107)","v":""},{"$f":"IF('DU LIEU NHAP VAO'!D107 = \"\",\"\",'DU LIEU NHAP VAO'!D107)","v":""},{"$f":"IF('DU LIEU NHAP VAO'!E107 = \"\",\"\",'DU LIEU NHAP VAO'!E107)","v":""},""]
[{"$f":"IF(C109=\"\",\"\",MAX($A$6:A108)+ 1)","v":""},"",{"$f":"IF(ISERROR(duonglich(D109)),\"\",duonglich(D109))","v":""},{"$f":"IF('DU LIEU NHAP VAO'!B108=\"\",\"\",TEXT('DU LIEU NHAP VAO'!B108,\"dd/MM\")&\"/\"&'DU LIEU NHAP VAO'!$I$6)","v":""},{"$f":"IF('DU LIEU NHAP VAO'!C108 = \"\",\"\",'DU LIEU NHAP VAO'!C108)","v":""},{"$f":"IF('DU LIEU NHAP VAO'!D108 = \"\",\"\",'DU LIEU NHAP VAO'!D108)","v":""},{"$f":"IF('DU LIEU NHAP VAO'!E108 = \"\",\"\",'DU LIEU NHAP VAO'!E108)","v":""},""]
[{"$f":"IF(C110=\"\",\"\",MAX($A$6:A109)+ 1)","v":""},"",{"$f":"IF(ISERROR(duonglich(D110)),\"\",duonglich(D110))","v":""},{"$f":"IF('DU LIEU NHAP VAO'!B109=\"\",\"\",TEXT('DU LIEU NHAP VAO'!B109,\"dd/MM\")&\"/\"&'DU LIEU NHAP VAO'!$I$6)","v":""},{"$f":"IF('DU LIEU NHAP VAO'!C109 = \"\",\"\",'DU LIEU NHAP VAO'!C109)","v":""},{"$f":"IF('DU LIEU NHAP VAO'!D109 = \"\",\"\",'DU LIEU NHAP VAO'!D109)","v":""},{"$f":"IF('DU LIEU NHAP VAO'!E109 = \"\",\"\",'DU LIEU NHAP VAO'!E109)","v":""},""]
[{"$f":"IF(C111=\"\",\"\",MAX($A$6:A110)+ 1)","v":""},"",{"$f":"IF(ISERROR(duonglich(D111)),\"\",duonglich(D111))","v":""},{"$f":"IF('DU LIEU NHAP VAO'!B110=\"\",\"\",TEXT('DU LIEU NHAP VAO'!B110,\"dd/MM\")&\"/\"&'DU LIEU NHAP VAO'!$I$6)","v":""},{"$f":"IF('DU LIEU NHAP VAO'!C110 = \"\",\"\",'DU LIEU NHAP VAO'!C110)","v":""},{"$f":"IF('DU LIEU NHAP VAO'!D110 = \"\",\"\",'DU LIEU NHAP VAO'!D110)","v":""},{"$f":"IF('DU LIEU NHAP VAO'!E110 = \"\",\"\",'DU LIEU NHAP VAO'!E110)","v":""},""]
[{"$f":"IF(C112=\"\",\"\",MAX($A$6:A111)+ 1)","v":""},"",{"$f":"IF(ISERROR(duonglich(D112)),\"\",duonglich(D112))","v":""},{"$f":"IF('DU LIEU NHAP VAO'!B111=\"\",\"\",TEXT('DU LIEU NHAP VAO'!B111,\"dd/MM\")&\"/\"&'DU LIEU NHAP VAO'!$I$6)","v":""},{"$f":"IF('DU LIEU NHAP VAO'!C111 = \"\",\"\",'DU LIEU NHAP VAO'!C111)","v":""},{"$f":"IF('DU LIEU NHAP VAO'!D111 = \"\",\"\",'DU LIEU NHAP VAO'!D111)","v":""},{"$f":"IF('DU LIEU NHAP VAO'!E111 = \"\",\"\",'DU LIEU NHAP VAO'!E111)","v":""},""]
[{"$f":"IF(C113=\"\",\"\",MAX($A$6:A112)+ 1)","v":""},"",{"$f":"IF(ISERROR(duonglich(D113)),\"\",duonglich(D113))","v":""},{"$f":"IF('DU LIEU NHAP VAO'!B112=\"\",\"\",TEXT('DU LIEU NHAP VAO'!B112,\"dd/MM\")&\"/\"&'DU LIEU NHAP VAO'!$I$6)","v":""},{"$f":"IF('DU LIEU NHAP VAO'!C112 = \"\",\"\",'DU LIEU NHAP VAO'!C112)","v":""},{"$f":"IF('DU LIEU NHAP VAO'!D112 = \"\",\"\",'DU LIEU NHAP VAO'!D112)","v":""},{"$f":"IF('DU LIEU NHAP VAO'!E112 = \"\",\"\",'DU LIEU NHAP VAO'!E112)","v":""},""]
[{"$f":"IF(C114=\"\",\"\",MAX($A$6:A113)+ 1)","v":""},"",{"$f":"IF(ISERROR(duonglich(D114)),\"\",duonglich(D114))","v":""},{"$f":"IF('DU LIEU NHAP VAO'!B113=\"\",\"\",TEXT('DU LIEU NHAP VAO'!B113,\"dd/MM\")&\"/\"&'DU LIEU NHAP VAO'!$I$6)","v":""},{"$f":"IF('DU LIEU NHAP VAO'!C113 = \"\",\"\",'DU LIEU NHAP VAO'!C113)","v":""},{"$f":"IF('DU LIEU NHAP VAO'!D113 = \"\",\"\",'DU LIEU NHAP VAO'!D113)","v":""},{"$f":"IF('DU LIEU NHAP VAO'!E113 = \"\",\"\",'DU LIEU NHAP VAO'!E113)","v":""},""]
[{"$f":"IF(C115=\"\",\"\",MAX($A$6:A114)+ 1)","v":""},"",{"$f":"IF(ISERROR(duonglich(D115)),\"\",duonglich(D115))","v":""},{"$f":"IF('DU LIEU NHAP VAO'!B114=\"\",\"\",TEXT('DU LIEU NHAP VAO'!B114,\"dd/MM\")&\"/\"&'DU LIEU NHAP VAO'!$I$6)","v":""},{"$f":"IF('DU LIEU NHAP VAO'!C114 = \"\",\"\",'DU LIEU NHAP VAO'!C114)","v":""},{"$f":"IF('DU LIEU NHAP VAO'!D114 = \"\",\"\",'DU LIEU NHAP VAO'!D114)","v":""},{"$f":"IF('DU LIEU NHAP VAO'!E114 = \"\",\"\",'DU LIEU NHAP VAO'!E114)","v":""},""]
[{"$f":"IF(C116=\"\",\"\",MAX($A$6:A115)+ 1)","v":""},"",{"$f":"IF(ISERROR(duonglich(D116)),\"\",duonglich(D116))","v":""},{"$f":"IF('DU LIEU NHAP VAO'!B115=\"\",\"\",TEXT('DU LIEU NHAP VAO'!B115,\"dd/MM\")&\"/\"&'DU LIEU NHAP VAO'!$I$6)","v":""},{"$f":"IF('DU LIEU NHAP VAO'!C115 = \"\",\"\",'DU LIEU NHAP VAO'!C115)","v":""},{"$f":"IF('DU LIEU NHAP VAO'!D115 = \"\",\"\",'DU LIEU NHAP VAO'!D115)","v":""},{"$f":"IF('DU LIEU NHAP VAO'!E115 = \"\",\"\",'DU LIEU NHAP VAO'!E115)","v":""},""]
[{"$f":"IF(C117=\"\",\"\",MAX($A$6:A116)+ 1)","v":""},"",{"$f":"IF(ISERROR(duonglich(D117)),\"\",duonglich(D117))","v":""},{"$f":"IF('DU LIEU NHAP VAO'!B116=\"\",\"\",TEXT('DU LIEU NHAP VAO'!B116,\"dd/MM\")&\"/\"&'DU LIEU NHAP VAO'!$I$6)","v":""},{"$f":"IF('DU LIEU NHAP VAO'!C116 = \"\",\"\",'DU LIEU NHAP VAO'!C116)","v":""},{"$f":"IF('DU LIEU NHAP VAO'!D116 = \"\",\"\",'DU LIEU NHAP VAO'!D116)","v":""},{"$f":"IF('DU LIEU NHAP VAO'!E116 = \"\",\"\",'DU LIEU NHAP VAO'!E116)","v":""},""]
[{"$f":"IF(C118=\"\",\"\",MAX($A$6:A117)+ 1)","v":""},"",{"$f":"IF(ISERROR(duonglich(D118)),\"\",duonglich(D118))","v":""},{"$f":"IF('DU LIEU NHAP VAO'!B117=\"\",\"\",TEXT('DU LIEU NHAP VAO'!B117,\"dd/MM\")&\"/\"&'DU LIEU NHAP VAO'!$I$6)","v":""},{"$f":"IF('DU LIEU NHAP VAO'!C117 = \"\",\"\",'DU LIEU NHAP VAO'!C117)","v":""},{"$f":"IF('DU LIEU NHAP VAO'!D117 = \"\",\"\",'DU LIEU NHAP VAO'!D117)","v":""},{"$f":"IF('DU LIEU NHAP VAO'!E117 = \"\",\"\",'DU LIEU NHAP VAO'!E117)","v":""},""]
[{"$f":"IF(C119=\"\",\"\",MAX($A$6:A118)+ 1)","v":""},"",{"$f":"IF(ISERROR(duonglich(D119)),\"\",duonglich(D119))","v":""},{"$f":"IF('DU LIEU NHAP VAO'!B118=\"\",\"\",TEXT('DU LIEU NHAP VAO'!B118,\"dd/MM\")&\"/\"&'DU LIEU NHAP VAO'!$I$6)","v":""},{"$f":"IF('DU LIEU NHAP VAO'!C118 = \"\",\"\",'DU LIEU NHAP VAO'!C118)","v":""},{"$f":"IF('DU LIEU NHAP VAO'!D118 = \"\",\"\",'DU LIEU NHAP VAO'!D118)","v":""},{"$f":"IF('DU LIEU NHAP VAO'!E118 = \"\",\"\",'DU LIEU NHAP VAO'!E118)","v":""},""]
[{"$f":"IF(C120=\"\",\"\",MAX($A$6:A119)+ 1)","v":""},"",{"$f":"IF(ISERROR(duonglich(D120)),\"\",duonglich(D120))","v":""},{"$f":"IF('DU LIEU NHAP VAO'!B119=\"\",\"\",TEXT('DU LIEU NHAP VAO'!B119,\"dd/MM\")&\"/\"&'DU LIEU NHAP VAO'!$I$6)","v":""},{"$f":"IF('DU LIEU NHAP VAO'!C119 = \"\",\"\",'DU LIEU NHAP VAO'!C119)","v":""},{"$f":"IF('DU LIEU NHAP VAO'!D119 = \"\",\"\",'DU LIEU NHAP VAO'!D119)","v":""},{"$f":"IF('DU LIEU NHAP VAO'!E119 = \"\",\"\",'DU LIEU NHAP VAO'!E119)","v":""},""]
[{"$f":"IF(C121=\"\",\"\",MAX($A$6:A120)+ 1)","v":""},"",{"$f":"IF(ISERROR(duonglich(D121)),\"\",duonglich(D121))","v":""},{"$f":"IF('DU LIEU NHAP VAO'!B120=\"\",\"\",TEXT('DU LIEU NHAP VAO'!B120,\"dd/MM\")&\"/\"&'DU LIEU NHAP VAO'!$I$6)","v":""},{"$f":"IF('DU LIEU NHAP VAO'!C120 = \"\",\"\",'DU LIEU NHAP VAO'!C120)","v":""},{"$f":"IF('DU LIEU NHAP VAO'!D120 = \"\",\"\",'DU LIEU NHAP VAO'!D120)","v":""},{"$f":"IF('DU LIEU NHAP VAO'!E120 = \"\",\"\",'DU LIEU NHAP VAO'!E120)","v":""},""]
[{"$f":"IF(C122=\"\",\"\",MAX($A$6:A121)+ 1)","v":""},"",{"$f":"IF(ISERROR(duonglich(D122)),\"\",duonglich(D122))","v":""},{"$f":"IF('DU LIEU NHAP VAO'!B121=\"\",\"\",TEXT('DU LIEU NHAP VAO'!B121,\"dd/MM\")&\"/\"&'DU LIEU NHAP VAO'!$I$6)","v":""},{"$f":"IF('DU LIEU NHAP VAO'!C121 = \"\",\"\",'DU LIEU NHAP VAO'!C121)","v":""},{"$f":"IF('DU LIEU NHAP VAO'!D121 = \"\",\"\",'DU LIEU NHAP VAO'!D121)","v":""},{"$f":"IF('DU LIEU NHAP VAO'!E121 = \"\",\"\",'DU LIEU NHAP VAO'!E121)","v":""},""]
[{"$f":"IF(C123=\"\",\"\",MAX($A$6:A122)+ 1)","v":""},"",{"$f":"IF(ISERROR(duonglich(D123)),\"\",duonglich(D123))","v":""},{"$f":"IF('DU LIEU NHAP VAO'!B122=\"\",\"\",TEXT('DU LIEU NHAP VAO'!B122,\"dd/MM\")&\"/\"&'DU LIEU NHAP VAO'!$I$6)","v":""},{"$f":"IF('DU LIEU NHAP VAO'!C122 = \"\",\"\",'DU LIEU NHAP VAO'!C122)","v":""},{"$f":"IF('DU LIEU NHAP VAO'!D122 = \"\",\"\",'DU LIEU NHAP VAO'!D122)","v":""},{"$f":"IF('DU LIEU NHAP VAO'!E122 = \"\",\"\",'DU LIEU NHAP VAO'!E122)","v":""},""]
[{"$f":"IF(C124=\"\",\"\",MAX($A$6:A123)+ 1)","v":""},"",{"$f":"IF(ISERROR(duonglich(D124)),\"\",duonglich(D124))","v":""},{"$f":"IF('DU LIEU NHAP VAO'!B123=\"\",\"\",TEXT('DU LIEU NHAP VAO'!B123,\"dd/MM\")&\"/\"&'DU LIEU NHAP VAO'!$I$6)","v":""},{"$f":"IF('DU LIEU NHAP VAO'!C123 = \"\",\"\",'DU LIEU NHAP VAO'!C123)","v":""},{"$f":"IF('DU LIEU NHAP VAO'!D123 = \"\",\"\",'DU LIEU NHAP VAO'!D123)","v":""},{"$f":"IF('DU LIEU NHAP VAO'!E123 = \"\",\"\",'DU LIEU NHAP VAO'!E123)","v":""},""]
[{"$f":"IF(C125=\"\",\"\",MAX($A$6:A124)+ 1)","v":""},"",{"$f":"IF(ISERROR(duonglich(D125)),\"\",duonglich(D125))","v":""},{"$f":"IF('DU LIEU NHAP VAO'!B124=\"\",\"\",TEXT('DU LIEU NHAP VAO'!B124,\"dd/MM\")&\"/\"&'DU LIEU NHAP VAO'!$I$6)","v":""},{"$f":"IF('DU LIEU NHAP VAO'!C124 = \"\",\"\",'DU LIEU NHAP VAO'!C124)","v":""},{"$f":"IF('DU LIEU NHAP VAO'!D124 = \"\",\"\",'DU LIEU NHAP VAO'!D124)","v":""},{"$f":"IF('DU LIEU NHAP VAO'!E124 = \"\",\"\",'DU LIEU NHAP VAO'!E124)","v":""},""]
[{"$f":"IF(C126=\"\",\"\",MAX($A$6:A125)+ 1)","v":""},"",{"$f":"IF(ISERROR(duonglich(D126)),\"\",duonglich(D126))","v":""},{"$f":"IF('DU LIEU NHAP VAO'!B125=\"\",\"\",TEXT('DU LIEU NHAP VAO'!B125,\"dd/MM\")&\"/\"&'DU LIEU NHAP VAO'!$I$6)","v":""},{"$f":"IF('DU LIEU NHAP VAO'!C125 = \"\",\"\",'DU LIEU NHAP VAO'!C125)","v":""},{"$f":"IF('DU LIEU NHAP VAO'!D125 = \"\",\"\",'DU LIEU NHAP VAO'!D125)","v":""},{"$f":"IF('DU LIEU NHAP VAO'!E125 = \"\",\"\",'DU LIEU NHAP VAO'!E125)","v":""},""]
[{"$f":"IF(C127=\"\",\"\",MAX($A$6:A126)+ 1)","v":""},"",{"$f":"IF(ISERROR(duonglich(D127)),\"\",duonglich(D127))","v":""},{"$f":"IF('DU LIEU NHAP VAO'!B126=\"\",\"\",TEXT('DU LIEU NHAP VAO'!B126,\"dd/MM\")&\"/\"&'DU LIEU NHAP VAO'!$I$6)","v":""},{"$f":"IF('DU LIEU NHAP VAO'!C126 = \"\",\"\",'DU LIEU NHAP VAO'!C126)","v":""},{"$f":"IF('DU LIEU NHAP VAO'!D126 = \"\",\"\",'DU LIEU NHAP VAO'!D126)","v":""},{"$f":"IF('DU LIEU NHAP VAO'!E126 = \"\",\"\",'DU LIEU NHAP VAO'!E126)","v":""},""]
[{"$f":"IF(C128=\"\",\"\",MAX($A$6:A127)+ 1)","v":""},"",{"$f":"IF(ISERROR(duonglich(D128)),\"\",duonglich(D128))","v":""},{"$f":"IF('DU LIEU NHAP VAO'!B127=\"\",\"\",TEXT('DU LIEU NHAP VAO'!B127,\"dd/MM\")&\"/\"&'DU LIEU NHAP VAO'!$I$6)","v":""},{"$f":"IF('DU LIEU NHAP VAO'!C127 = \"\",\"\",'DU LIEU NHAP VAO'!C127)","v":""},{"$f":"IF('DU LIEU NHAP VAO'!D127 = \"\",\"\",'DU LIEU NHAP VAO'!D127)","v":""},{"$f":"IF('DU LIEU NHAP VAO'!E127 = \"\",\"\",'DU LIEU NHAP VAO'!E127)","v":""},""]
[{"$f":"IF(C129=\"\",\"\",MAX($A$6:A128)+ 1)","v":""},"",{"$f":"IF(ISERROR(duonglich(D129)),\"\",duonglich(D129))","v":""},{"$f":"IF('DU LIEU NHAP VAO'!B128=\"\",\"\",TEXT('DU LIEU NHAP VAO'!B128,\"dd/MM\")&\"/\"&'DU LIEU NHAP VAO'!$I$6)","v":""},{"$f":"IF('DU LIEU NHAP VAO'!C128 = \"\",\"\",'DU LIEU NHAP VAO'!C128)","v":""},{"$f":"IF('DU LIEU NHAP VAO'!D128 = \"\",\"\",'DU LIEU NHAP VAO'!D128)","v":""},{"$f":"IF('DU LIEU NHAP VAO'!E128 = \"\",\"\",'DU LIEU NHAP VAO'!E128)","v":""},""]
[{"$f":"IF(C130=\"\",\"\",MAX($A$6:A129)+ 1)","v":""},"",{"$f":"IF(ISERROR(duonglich(D130)),\"\",duonglich(D130))","v":""},{"$f":"IF('DU LIEU NHAP VAO'!B129=\"\",\"\",TEXT('DU LIEU NHAP VAO'!B129,\"dd/MM\")&\"/\"&'DU LIEU NHAP VAO'!$I$6)","v":""},{"$f":"IF('DU LIEU NHAP VAO'!C129 = \"\",\"\",'DU LIEU NHAP VAO'!C129)","v":""},{"$f":"IF('DU LIEU NHAP VAO'!D129 = \"\",\"\",'DU LIEU NHAP VAO'!D129)","v":""},{"$f":"IF('DU LIEU NHAP VAO'!E129 = \"\",\"\",'DU LIEU NHAP VAO'!E129)","v":""},""]
[{"$f":"IF(C131=\"\",\"\",MAX($A$6:A130)+ 1)","v":""},"",{"$f":"IF(ISERROR(duonglich(D131)),\"\",duonglich(D131))","v":""},{"$f":"IF('DU LIEU NHAP VAO'!B130=\"\",\"\",TEXT('DU LIEU NHAP VAO'!B130,\"dd/MM\")&\"/\"&'DU LIEU NHAP VAO'!$I$6)","v":""},{"$f":"IF('DU LIEU NHAP VAO'!C130 = \"\",\"\",'DU LIEU NHAP VAO'!C130)","v":""},{"$f":"IF('DU LIEU NHAP VAO'!D130 = \"\",\"\",'DU LIEU NHAP VAO'!D130)","v":""},{"$f":"IF('DU LIEU NHAP VAO'!E130 = \"\",\"\",'DU LIEU NHAP VAO'!E130)","v":""},""]
[{"$f":"IF(C132=\"\",\"\",MAX($A$6:A131)+ 1)","v":""},"",{"$f":"IF(ISERROR(duonglich(D132)),\"\",duonglich(D132))","v":""},{"$f":"IF('DU LIEU NHAP VAO'!B131=\"\",\"\",TEXT('DU LIEU NHAP VAO'!B131,\"dd/MM\")&\"/\"&'DU LIEU NHAP VAO'!$I$6)","v":""},{"$f":"IF('DU LIEU NHAP VAO'!C131 = \"\",\"\",'DU LIEU NHAP VAO'!C131)","v":""},{"$f":"IF('DU LIEU NHAP VAO'!D131 = \"\",\"\",'DU LIEU NHAP VAO'!D131)","v":""},{"$f":"IF('DU LIEU NHAP VAO'!E131 = \"\",\"\",'DU LIEU NHAP VAO'!E131)","v":""},""]
[{"$f":"IF(C133=\"\",\"\",MAX($A$6:A132)+ 1)","v":""},"",{"$f":"IF(ISERROR(duonglich(D133)),\"\",duonglich(D133))","v":""},{"$f":"IF('DU LIEU NHAP VAO'!B132=\"\",\"\",TEXT('DU LIEU NHAP VAO'!B132,\"dd/MM\")&\"/\"&'DU LIEU NHAP VAO'!$I$6)","v":""},{"$f":"IF('DU LIEU NHAP VAO'!C132 = \"\",\"\",'DU LIEU NHAP VAO'!C132)","v":""},{"$f":"IF('DU LIEU NHAP VAO'!D132 = \"\",\"\",'DU LIEU NHAP VAO'!D132)","v":""},{"$f":"IF('DU LIEU NHAP VAO'!E132 = \"\",\"\",'DU LIEU NHAP VAO'!E132)","v":""},""]
[{"$f":"IF(C134=\"\",\"\",MAX($A$6:A133)+ 1)","v":""},"",{"$f":"IF(ISERROR(duonglich(D134)),\"\",duonglich(D134))","v":""},{"$f":"IF('DU LIEU NHAP VAO'!B133=\"\",\"\",TEXT('DU LIEU NHAP VAO'!B133,\"dd/MM\")&\"/\"&'DU LIEU NHAP VAO'!$I$6)","v":""},{"$f":"IF('DU LIEU NHAP VAO'!C133 = \"\",\"\",'DU LIEU NHAP VAO'!C133)","v":""},{"$f":"IF('DU LIEU NHAP VAO'!D133 = \"\",\"\",'DU LIEU NHAP VAO'!D133)","v":""},{"$f":"IF('DU LIEU NHAP VAO'!E133 = \"\",\"\",'DU LIEU NHAP VAO'!E133)","v":""},""]
[{"$f":"IF(C135=\"\",\"\",MAX($A$6:A134)+ 1)","v":""},{"$f":"IF(C135=\"\",\"\",IF(WEEKDAY(C135,1)=1,\"CN\",\"T\"&WEEKDAY(C135,1)))","v":""},{"$f":"IF(ISERROR(duonglich(D135)),\"\",duonglich(D135))","v":""},{"$f":"IF('DU LIEU NHAP VAO'!B134=\"\",\"\",TEXT('DU LIEU NHAP VAO'!B134,\"dd/MM\")&\"/\"&'DU LIEU NHAP VAO'!$I$6)","v":""},{"$f":"IF('DU LIEU NHAP VAO'!C134 = \"\",\"\",'DU LIEU NHAP VAO'!C134)","v":""},{"$f":"IF('DU LIEU NHAP VAO'!D134 = \"\",\"\",'DU LIEU NHAP VAO'!D134)","v":""},{"$f":"IF('DU LIEU NHAP VAO'!E134 = \"\",\"\",'DU LIEU NHAP VAO'!E134)","v":""},{"$f":"IF(E135=\"\",\"\",IF(AND(ABS(DAYS360($N$2,C135))<>0, YEAR(C135) = YEAR(NOW()),MONTH(C135) < MONTH(NOW())),\"Đã qua \"&ABS(DAYS360(C135,$N$2))&\" ngày\",\"Còn \"&ABS(DAYS360(C135,$N$2))&\" ngày\"))","v":""}]
[{"$f":"IF(C136=\"\",\"\",MAX($A$6:A135)+ 1)","v":""},"",{"$f":"IF(ISERROR(duonglich(D136)),\"\",duonglich(D136))","v":""},{"$f":"IF('DU LIEU NHAP VAO'!B135=\"\",\"\",TEXT('DU LIEU NHAP VAO'!B135,\"dd/MM\")&\"/\"&'DU LIEU NHAP VAO'!$I$6)","v":""},{"$f":"IF('DU LIEU NHAP VAO'!C135 = \"\",\"\",'DU LIEU NHAP VAO'!C135)","v":""},{"$f":"IF('DU LIEU NHAP VAO'!D135 = \"\",\"\",'DU LIEU NHAP VAO'!D135)","v":""},{"$f":"IF('DU LIEU NHAP VAO'!E135 = \"\",\"\",'DU LIEU NHAP VAO'!E135)","v":""},""]
[{"$f":"IF(C137=\"\",\"\",MAX($A$6:A136)+ 1)","v":""},"",{"$f":"IF(ISERROR(duonglich(D137)),\"\",duonglich(D137))","v":""},{"$f":"IF('DU LIEU NHAP VAO'!B136=\"\",\"\",TEXT('DU LIEU NHAP VAO'!B136,\"dd/MM\")&\"/\"&'DU LIEU NHAP VAO'!$I$6)","v":""},{"$f":"IF('DU LIEU NHAP VAO'!C136 = \"\",\"\",'DU LIEU NHAP VAO'!C136)","v":""},{"$f":"IF('DU LIEU NHAP VAO'!D136 = \"\",\"\",'DU LIEU NHAP VAO'!D136)","v":""},{"$f":"IF('DU LIEU NHAP VAO'!E136 = \"\",\"\",'DU LIEU NHAP VAO'!E136)","v":""},""]
[{"$f":"IF(C138=\"\",\"\",MAX($A$6:A137)+ 1)","v":""},"",{"$f":"IF(ISERROR(duonglich(D138)),\"\",duonglich(D138))","v":""},{"$f":"IF('DU LIEU NHAP VAO'!B137=\"\",\"\",TEXT('DU LIEU NHAP VAO'!B137,\"dd/MM\")&\"/\"&'DU LIEU NHAP VAO'!$I$6)","v":""},{"$f":"IF('DU LIEU NHAP VAO'!C137 = \"\",\"\",'DU LIEU NHAP VAO'!C137)","v":""},{"$f":"IF('DU LIEU NHAP VAO'!D137 = \"\",\"\",'DU LIEU NHAP VAO'!D137)","v":""},{"$f":"IF('DU LIEU NHAP VAO'!E137 = \"\",\"\",'DU LIEU NHAP VAO'!E137)","v":""},""]
[{"$f":"IF(C139=\"\",\"\",MAX($A$6:A138)+ 1)","v":""},"",{"$f":"IF(ISERROR(duonglich(D139)),\"\",duonglich(D139))","v":""},{"$f":"IF('DU LIEU NHAP VAO'!B138=\"\",\"\",TEXT('DU LIEU NHAP VAO'!B138,\"dd/MM\")&\"/\"&'DU LIEU NHAP VAO'!$I$6)","v":""},{"$f":"IF('DU LIEU NHAP VAO'!C138 = \"\",\"\",'DU LIEU NHAP VAO'!C138)","v":""},{"$f":"IF('DU LIEU NHAP VAO'!D138 = \"\",\"\",'DU LIEU NHAP VAO'!D138)","v":""},{"$f":"IF('DU LIEU NHAP VAO'!E138 = \"\",\"\",'DU LIEU NHAP VAO'!E138)","v":""},""]
[{"$f":"IF(C140=\"\",\"\",MAX($A$6:A139)+ 1)","v":""},"",{"$f":"IF(ISERROR(duonglich(D140)),\"\",duonglich(D140))","v":""},{"$f":"IF('DU LIEU NHAP VAO'!B139=\"\",\"\",TEXT('DU LIEU NHAP VAO'!B139,\"dd/MM\")&\"/\"&'DU LIEU NHAP VAO'!$I$6)","v":""},{"$f":"IF('DU LIEU NHAP VAO'!C139 = \"\",\"\",'DU LIEU NHAP VAO'!C139)","v":""},{"$f":"IF('DU LIEU NHAP VAO'!D139 = \"\",\"\",'DU LIEU NHAP VAO'!D139)","v":""},{"$f":"IF('DU LIEU NHAP VAO'!E139 = \"\",\"\",'DU LIEU NHAP VAO'!E139)","v":""},""]
[{"$f":"IF(C141=\"\",\"\",MAX($A$6:A140)+ 1)","v":""},"",{"$f":"IF(ISERROR(duonglich(D141)),\"\",duonglich(D141))","v":""},{"$f":"IF('DU LIEU NHAP VAO'!B140=\"\",\"\",TEXT('DU LIEU NHAP VAO'!B140,\"dd/MM\")&\"/\"&'DU LIEU NHAP VAO'!$I$6)","v":""},{"$f":"IF('DU LIEU NHAP VAO'!C140 = \"\",\"\",'DU LIEU NHAP VAO'!C140)","v":""},{"$f":"IF('DU LIEU NHAP VAO'!D140 = \"\",\"\",'DU LIEU NHAP VAO'!D140)","v":""},{"$f":"IF('DU LIEU NHAP VAO'!E140 = \"\",\"\",'DU LIEU NHAP VAO'!E140)","v":""},""]
[{"$f":"IF(C142=\"\",\"\",MAX($A$6:A141)+ 1)","v":""},"",{"$f":"IF(ISERROR(duonglich(D142)),\"\",duonglich(D142))","v":""},{"$f":"IF('DU LIEU NHAP VAO'!B141=\"\",\"\",TEXT('DU LIEU NHAP VAO'!B141,\"dd/MM\")&\"/\"&'DU LIEU NHAP VAO'!$I$6)","v":""},{"$f":"IF('DU LIEU NHAP VAO'!C141 = \"\",\"\",'DU LIEU NHAP VAO'!C141)","v":""},{"$f":"IF('DU LIEU NHAP VAO'!D141 = \"\",\"\",'DU LIEU NHAP VAO'!D141)","v":""},{"$f":"IF('DU LIEU NHAP VAO'!E141 = \"\",\"\",'DU LIEU NHAP VAO'!E141)","v":""},""]
[{"$f":"IF(C143=\"\",\"\",MAX($A$6:A142)+ 1)","v":""},"",{"$f":"IF(ISERROR(duonglich(D143)),\"\",duonglich(D143))","v":""},{"$f":"IF('DU LIEU NHAP VAO'!B142=\"\",\"\",TEXT('DU LIEU NHAP VAO'!B142,\"dd/MM\")&\"/\"&'DU LIEU NHAP VAO'!$I$6)","v":""},{"$f":"IF('DU LIEU NHAP VAO'!C142 = \"\",\"\",'DU LIEU NHAP VAO'!C142)","v":""},{"$f":"IF('DU LIEU NHAP VAO'!D142 = \"\",\"\",'DU LIEU NHAP VAO'!D142)","v":""},{"$f":"IF('DU LIEU NHAP VAO'!E142 = \"\",\"\",'DU LIEU NHAP VAO'!E142)","v":""},""]
[{"$f":"IF(C144=\"\",\"\",MAX($A$6:A143)+ 1)","v":""},"",{"$f":"IF(ISERROR(duonglich(D144)),\"\",duonglich(D144))","v":""},{"$f":"IF('DU LIEU NHAP VAO'!B143=\"\",\"\",TEXT('DU LIEU NHAP VAO'!B143,\"dd/MM\")&\"/\"&'DU LIEU NHAP VAO'!$I$6)","v":""},{"$f":"IF('DU LIEU NHAP VAO'!C143 = \"\",\"\",'DU LIEU NHAP VAO'!C143)","v":""},{"$f":"IF('DU LIEU NHAP VAO'!D143 = \"\",\"\",'DU LIEU NHAP VAO'!D143)","v":""},{"$f":"IF('DU LIEU NHAP VAO'!E143 = \"\",\"\",'DU LIEU NHAP VAO'!E143)","v":""},""]
[{"$f":"IF(C145=\"\",\"\",MAX($A$6:A144)+ 1)","v":""},"",{"$f":"IF(ISERROR(duonglich(D145)),\"\",duonglich(D145))","v":""},{"$f":"IF('DU LIEU NHAP VAO'!B144=\"\",\"\",TEXT('DU LIEU NHAP VAO'!B144,\"dd/MM\")&\"/\"&'DU LIEU NHAP VAO'!$I$6)","v":""},{"$f":"IF('DU LIEU NHAP VAO'!C144 = \"\",\"\",'DU LIEU NHAP VAO'!C144)","v":""},{"$f":"IF('DU LIEU NHAP VAO'!D144 = \"\",\"\",'DU LIEU NHAP VAO'!D144)","v":""},{"$f":"IF('DU LIEU NHAP VAO'!E144 = \"\",\"\",'DU LIEU NHAP VAO'!E144)","v":""},""]
[{"$f":"IF(C146=\"\",\"\",MAX($A$6:A145)+ 1)","v":""},"",{"$f":"IF(ISERROR(duonglich(D146)),\"\",duonglich(D146))","v":""},{"$f":"IF('DU LIEU NHAP VAO'!B145=\"\",\"\",TEXT('DU LIEU NHAP VAO'!B145,\"dd/MM\")&\"/\"&'DU LIEU NHAP VAO'!$I$6)","v":""},{"$f":"IF('DU LIEU NHAP VAO'!C145 = \"\",\"\",'DU LIEU NHAP VAO'!C145)","v":""},{"$f":"IF('DU LIEU NHAP VAO'!D145 = \"\",\"\",'DU LIEU NHAP VAO'!D145)","v":""},{"$f":"IF('DU LIEU NHAP VAO'!E145 = \"\",\"\",'DU LIEU NHAP VAO'!E145)","v":""},""]
[{"$f":"IF(C147=\"\",\"\",MAX($A$6:A146)+ 1)","v":""},"",{"$f":"IF(ISERROR(duonglich(D147)),\"\",duonglich(D147))","v":""},{"$f":"IF('DU LIEU NHAP VAO'!B146=\"\",\"\",TEXT('DU LIEU NHAP VAO'!B146,\"dd/MM\")&\"/\"&'DU LIEU NHAP VAO'!$I$6)","v":""},{"$f":"IF('DU LIEU NHAP VAO'!C146 = \"\",\"\",'DU LIEU NHAP VAO'!C146)","v":""},{"$f":"IF('DU LIEU NHAP VAO'!D146 = \"\",\"\",'DU LIEU NHAP VAO'!D146)","v":""},{"$f":"IF('DU LIEU NHAP VAO'!E146 = \"\",\"\",'DU LIEU NHAP VAO'!E146)","v":""},""]
[{"$f":"IF(C148=\"\",\"\",MAX($A$6:A147)+ 1)","v":""},"",{"$f":"IF(ISERROR(duonglich(D148)),\"\",duonglich(D148))","v":""},{"$f":"IF('DU LIEU NHAP VAO'!B147=\"\",\"\",TEXT('DU LIEU NHAP VAO'!B147,\"dd/MM\")&\"/\"&'DU LIEU NHAP VAO'!$I$6)","v":""},{"$f":"IF('DU LIEU NHAP VAO'!C147 = \"\",\"\",'DU LIEU NHAP VAO'!C147)","v":""},{"$f":"IF('DU LIEU NHAP VAO'!D147 = \"\",\"\",'DU LIEU NHAP VAO'!D147)","v":""},{"$f":"IF('DU LIEU NHAP VAO'!E147 = \"\",\"\",'DU LIEU NHAP VAO'!E147)","v":""},""]
[{"$f":"IF(C149=\"\",\"\",MAX($A$6:A148)+ 1)","v":""},"",{"$f":"IF(ISERROR(duonglich(D149)),\"\",duonglich(D149))","v":""},{"$f":"IF('DU LIEU NHAP VAO'!B148=\"\",\"\",TEXT('DU LIEU NHAP VAO'!B148,\"dd/MM\")&\"/\"&'DU LIEU NHAP VAO'!$I$6)","v":""},{"$f":"IF('DU LIEU NHAP VAO'!C148 = \"\",\"\",'DU LIEU NHAP VAO'!C148)","v":""},{"$f":"IF('DU LIEU NHAP VAO'!D148 = \"\",\"\",'DU LIEU NHAP VAO'!D148)","v":""},{"$f":"IF('DU LIEU NHAP VAO'!E148 = \"\",\"\",'DU LIEU NHAP VAO'!E148)","v":""},""]
[{"$f":"IF(C150=\"\",\"\",MAX($A$6:A149)+ 1)","v":""},"",{"$f":"IF(ISERROR(duonglich(D150)),\"\",duonglich(D150))","v":""},{"$f":"IF('DU LIEU NHAP VAO'!B149=\"\",\"\",TEXT('DU LIEU NHAP VAO'!B149,\"dd/MM\")&\"/\"&'DU LIEU NHAP VAO'!$I$6)","v":""},{"$f":"IF('DU LIEU NHAP VAO'!C149 = \"\",\"\",'DU LIEU NHAP VAO'!C149)","v":""},{"$f":"IF('DU LIEU NHAP VAO'!D149 = \"\",\"\",'DU LIEU NHAP VAO'!D149)","v":""},{"$f":"IF('DU LIEU NHAP VAO'!E149 = \"\",\"\",'DU LIEU NHAP VAO'!E149)","v":""},""]
[{"$f":"IF(C151=\"\",\"\",MAX($A$6:A150)+ 1)","v":""},"",{"$f":"IF(ISERROR(duonglich(D151)),\"\",duonglich(D151))","v":""},{"$f":"IF('DU LIEU NHAP VAO'!B150=\"\",\"\",TEXT('DU LIEU NHAP VAO'!B150,\"dd/MM\")&\"/\"&'DU LIEU NHAP VAO'!$I$6)","v":""},{"$f":"IF('DU LIEU NHAP VAO'!C150 = \"\",\"\",'DU LIEU NHAP VAO'!C150)","v":""},{"$f":"IF('DU LIEU NHAP VAO'!D150 = \"\",\"\",'DU LIEU NHAP VAO'!D150)","v":""},{"$f":"IF('DU LIEU NHAP VAO'!E150 = \"\",\"\",'DU LIEU NHAP VAO'!E150)","v":""},""]
[{"$f":"IF(C152=\"\",\"\",MAX($A$6:A151)+ 1)","v":""},"",{"$f":"IF(ISERROR(duonglich(D152)),\"\",duonglich(D152))","v":""},{"$f":"IF('DU LIEU NHAP VAO'!B151=\"\",\"\",TEXT('DU LIEU NHAP VAO'!B151,\"dd/MM\")&\"/\"&'DU LIEU NHAP VAO'!$I$6)","v":""},{"$f":"IF('DU LIEU NHAP VAO'!C151 = \"\",\"\",'DU LIEU NHAP VAO'!C151)","v":""},{"$f":"IF('DU LIEU NHAP VAO'!D151 = \"\",\"\",'DU LIEU NHAP VAO'!D151)","v":""},{"$f":"IF('DU LIEU NHAP VAO'!E151 = \"\",\"\",'DU LIEU NHAP VAO'!E151)","v":""},""]
[{"$f":"IF(C153=\"\",\"\",MAX($A$6:A152)+ 1)","v":""},"",{"$f":"IF(ISERROR(duonglich(D153)),\"\",duonglich(D153))","v":""},{"$f":"IF('DU LIEU NHAP VAO'!B152=\"\",\"\",TEXT('DU LIEU NHAP VAO'!B152,\"dd/MM\")&\"/\"&'DU LIEU NHAP VAO'!$I$6)","v":""},{"$f":"IF('DU LIEU NHAP VAO'!C152 = \"\",\"\",'DU LIEU NHAP VAO'!C152)","v":""},{"$f":"IF('DU LIEU NHAP VAO'!D152 = \"\",\"\",'DU LIEU NHAP VAO'!D152)","v":""},{"$f":"IF('DU LIEU NHAP VAO'!E152 = \"\",\"\",'DU LIEU NHAP VAO'!E152)","v":""},""]
[{"$f":"IF(C154=\"\",\"\",MAX($A$6:A153)+ 1)","v":""},"",{"$f":"IF(ISERROR(duonglich(D154)),\"\",duonglich(D154))","v":""},{"$f":"IF('DU LIEU NHAP VAO'!B153=\"\",\"\",TEXT('DU LIEU NHAP VAO'!B153,\"dd/MM\")&\"/\"&'DU LIEU NHAP VAO'!$I$6)","v":""},{"$f":"IF('DU LIEU NHAP VAO'!C153 = \"\",\"\",'DU LIEU NHAP VAO'!C153)","v":""},{"$f":"IF('DU LIEU NHAP VAO'!D153 = \"\",\"\",'DU LIEU NHAP VAO'!D153)","v":""},{"$f":"IF('DU LIEU NHAP VAO'!E153 = \"\",\"\",'DU LIEU NHAP VAO'!E153)","v":""},""]
[{"$f":"IF(C155=\"\",\"\",MAX($A$6:A154)+ 1)","v":""},"",{"$f":"IF(ISERROR(duonglich(D155)),\"\",duonglich(D155))","v":""},{"$f":"IF('DU LIEU NHAP VAO'!B154=\"\",\"\",TEXT('DU LIEU NHAP VAO'!B154,\"dd/MM\")&\"/\"&'DU LIEU NHAP VAO'!$I$6)","v":""},{"$f":"IF('DU LIEU NHAP VAO'!C154 = \"\",\"\",'DU LIEU NHAP VAO'!C154)","v":""},{"$f":"IF('DU LIEU NHAP VAO'!D154 = \"\",\"\",'DU LIEU NHAP VAO'!D154)","v":""},{"$f":"IF('DU LIEU NHAP VAO'!E154 = \"\",\"\",'DU LIEU NHAP VAO'!E154)","v":""},""]
[{"$f":"IF(C156=\"\",\"\",MAX($A$6:A155)+ 1)","v":""},"",{"$f":"IF(ISERROR(duonglich(D156)),\"\",duonglich(D156))","v":""},{"$f":"IF('DU LIEU NHAP VAO'!B155=\"\",\"\",TEXT('DU LIEU NHAP VAO'!B155,\"dd/MM\")&\"/\"&'DU LIEU NHAP VAO'!$I$6)","v":""},{"$f":"IF('DU LIEU NHAP VAO'!C155 = \"\",\"\",'DU LIEU NHAP VAO'!C155)","v":""},{"$f":"IF('DU LIEU NHAP VAO'!D155 = \"\",\"\",'DU LIEU NHAP VAO'!D155)","v":""},{"$f":"IF('DU LIEU NHAP VAO'!E155 = \"\",\"\",'DU LIEU NHAP VAO'!E155)","v":""},""]
[{"$f":"IF(C157=\"\",\"\",MAX($A$6:A156)+ 1)","v":""},"",{"$f":"IF(ISERROR(duonglich(D157)),\"\",duonglich(D157))","v":""},{"$f":"IF('DU LIEU NHAP VAO'!B156=\"\",\"\",TEXT('DU LIEU NHAP VAO'!B156,\"dd/MM\")&\"/\"&'DU LIEU NHAP VAO'!$I$6)","v":""},{"$f":"IF('DU LIEU NHAP VAO'!C156 = \"\",\"\",'DU LIEU NHAP VAO'!C156)","v":""},{"$f":"IF('DU LIEU NHAP VAO'!D156 = \"\",\"\",'DU LIEU NHAP VAO'!D156)","v":""},{"$f":"IF('DU LIEU NHAP VAO'!E156 = \"\",\"\",'DU LIEU NHAP VAO'!E156)","v":""},""]
[{"$f":"IF(C158=\"\",\"\",MAX($A$6:A157)+ 1)","v":""},"",{"$f":"IF(ISERROR(duonglich(D158)),\"\",duonglich(D158))","v":""},{"$f":"IF('DU LIEU NHAP VAO'!B157=\"\",\"\",TEXT('DU LIEU NHAP VAO'!B157,\"dd/MM\")&\"/\"&'DU LIEU NHAP VAO'!$I$6)","v":""},{"$f":"IF('DU LIEU NHAP VAO'!C157 = \"\",\"\",'DU LIEU NHAP VAO'!C157)","v":""},{"$f":"IF('DU LIEU NHAP VAO'!D157 = \"\",\"\",'DU LIEU NHAP VAO'!D157)","v":""},{"$f":"IF('DU LIEU NHAP VAO'!E157 = \"\",\"\",'DU LIEU NHAP VAO'!E157)","v":""},""]
[{"$f":"IF(C159=\"\",\"\",MAX($A$6:A158)+ 1)","v":""},"",{"$f":"IF(ISERROR(duonglich(D159)),\"\",duonglich(D159))","v":""},{"$f":"IF('DU LIEU NHAP VAO'!B158=\"\",\"\",TEXT('DU LIEU NHAP VAO'!B158,\"dd/MM\")&\"/\"&'DU LIEU NHAP VAO'!$I$6)","v":""},{"$f":"IF('DU LIEU NHAP VAO'!C158 = \"\",\"\",'DU LIEU NHAP VAO'!C158)","v":""},{"$f":"IF('DU LIEU NHAP VAO'!D158 = \"\",\"\",'DU LIEU NHAP VAO'!D158)","v":""},{"$f":"IF('DU LIEU NHAP VAO'!E158 = \"\",\"\",'DU LIEU NHAP VAO'!E158)","v":""},""]
[{"$f":"IF(C160=\"\",\"\",MAX($A$6:A159)+ 1)","v":""},"",{"$f":"IF(ISERROR(duonglich(D160)),\"\",duonglich(D160))","v":""},{"$f":"IF('DU LIEU NHAP VAO'!B159=\"\",\"\",TEXT('DU LIEU NHAP VAO'!B159,\"dd/MM\")&\"/\"&'DU LIEU NHAP VAO'!$I$6)","v":""},{"$f":"IF('DU LIEU NHAP VAO'!C159 = \"\",\"\",'DU LIEU NHAP VAO'!C159)","v":""},{"$f":"IF('DU LIEU NHAP VAO'!D159 = \"\",\"\",'DU LIEU NHAP VAO'!D159)","v":""},{"$f":"IF('DU LIEU NHAP VAO'!E159 = \"\",\"\",'DU LIEU NHAP VAO'!E159)","v":""},""]
[{"$f":"IF(C161=\"\",\"\",MAX($A$6:A160)+ 1)","v":""},"",{"$f":"IF(ISERROR(duonglich(D161)),\"\",duonglich(D161))","v":""},{"$f":"IF('DU LIEU NHAP VAO'!B160=\"\",\"\",TEXT('DU LIEU NHAP VAO'!B160,\"dd/MM\")&\"/\"&'DU LIEU NHAP VAO'!$I$6)","v":""},{"$f":"IF('DU LIEU NHAP VAO'!C160 = \"\",\"\",'DU LIEU NHAP VAO'!C160)","v":""},{"$f":"IF('DU LIEU NHAP VAO'!D160 = \"\",\"\",'DU LIEU NHAP VAO'!D160)","v":""},{"$f":"IF('DU LIEU NHAP VAO'!E160 = \"\",\"\",'DU LIEU NHAP VAO'!E160)","v":""},""]
[{"$f":"IF(C162=\"\",\"\",MAX($A$6:A161)+ 1)","v":""},"",{"$f":"IF(ISERROR(duonglich(D162)),\"\",duonglich(D162))","v":""},{"$f":"IF('DU LIEU NHAP VAO'!B161=\"\",\"\",TEXT('DU LIEU NHAP VAO'!B161,\"dd/MM\")&\"/\"&'DU LIEU NHAP VAO'!$I$6)","v":""},{"$f":"IF('DU LIEU NHAP VAO'!C161 = \"\",\"\",'DU LIEU NHAP VAO'!C161)","v":""},{"$f":"IF('DU LIEU NHAP VAO'!D161 = \"\",\"\",'DU LIEU NHAP VAO'!D161)","v":""},{"$f":"IF('DU LIEU NHAP VAO'!E161 = \"\",\"\",'DU LIEU NHAP VAO'!E161)","v":""},""]
[{"$f":"IF(C163=\"\",\"\",MAX($A$6:A162)+ 1)","v":""},"",{"$f":"IF(ISERROR(duonglich(D163)),\"\",duonglich(D163))","v":""},{"$f":"IF('DU LIEU NHAP VAO'!B162=\"\",\"\",TEXT('DU LIEU NHAP VAO'!B162,\"dd/MM\")&\"/\"&'DU LIEU NHAP VAO'!$I$6)","v":""},{"$f":"IF('DU LIEU NHAP VAO'!C162 = \"\",\"\",'DU LIEU NHAP VAO'!C162)","v":""},{"$f":"IF('DU LIEU NHAP VAO'!D162 = \"\",\"\",'DU LIEU NHAP VAO'!D162)","v":""},{"$f":"IF('DU LIEU NHAP VAO'!E162 = \"\",\"\",'DU LIEU NHAP VAO'!E162)","v":""},""]
[{"$f":"IF(C164=\"\",\"\",MAX($A$6:A163)+ 1)","v":""},"",{"$f":"IF(ISERROR(duonglich(D164)),\"\",duonglich(D164))","v":""},{"$f":"IF('DU LIEU NHAP VAO'!B163=\"\",\"\",TEXT('DU LIEU NHAP VAO'!B163,\"dd/MM\")&\"/\"&'DU LIEU NHAP VAO'!$I$6)","v":""},{"$f":"IF('DU LIEU NHAP VAO'!C163 = \"\",\"\",'DU LIEU NHAP VAO'!C163)","v":""},{"$f":"IF('DU LIEU NHAP VAO'!D163 = \"\",\"\",'DU LIEU NHAP VAO'!D163)","v":""},{"$f":"IF('DU LIEU NHAP VAO'!E163 = \"\",\"\",'DU LIEU NHAP VAO'!E163)","v":""},""]
[{"$f":"IF(C165=\"\",\"\",MAX($A$6:A164)+ 1)","v":""},"",{"$f":"IF(ISERROR(duonglich(D165)),\"\",duonglich(D165))","v":""},{"$f":"IF('DU LIEU NHAP VAO'!B164=\"\",\"\",TEXT('DU LIEU NHAP VAO'!B164,\"dd/MM\")&\"/\"&'DU LIEU NHAP VAO'!$I$6)","v":""},{"$f":"IF('DU LIEU NHAP VAO'!C164 = \"\",\"\",'DU LIEU NHAP VAO'!C164)","v":""},{"$f":"IF('DU LIEU NHAP VAO'!D164 = \"\",\"\",'DU LIEU NHAP VAO'!D164)","v":""},{"$f":"IF('DU LIEU NHAP VAO'!E164 = \"\",\"\",'DU LIEU NHAP VAO'!E164)","v":""},""]
[{"$f":"IF(C166=\"\",\"\",MAX($A$6:A165)+ 1)","v":""},"",{"$f":"IF(ISERROR(duonglich(D166)),\"\",duonglich(D166))","v":""},{"$f":"IF('DU LIEU NHAP VAO'!B165=\"\",\"\",TEXT('DU LIEU NHAP VAO'!B165,\"dd/MM\")&\"/\"&'DU LIEU NHAP VAO'!$I$6)","v":""},{"$f":"IF('DU LIEU NHAP VAO'!C165 = \"\",\"\",'DU LIEU NHAP VAO'!C165)","v":""},{"$f":"IF('DU LIEU NHAP VAO'!D165 = \"\",\"\",'DU LIEU NHAP VAO'!D165)","v":""},{"$f":"IF('DU LIEU NHAP VAO'!E165 = \"\",\"\",'DU LIEU NHAP VAO'!E165)","v":""},""]
[{"$f":"IF(C167=\"\",\"\",MAX($A$6:A166)+ 1)","v":""},"",{"$f":"IF(ISERROR(duonglich(D167)),\"\",duonglich(D167))","v":""},{"$f":"IF('DU LIEU NHAP VAO'!B166=\"\",\"\",TEXT('DU LIEU NHAP VAO'!B166,\"dd/MM\")&\"/\"&'DU LIEU NHAP VAO'!$I$6)","v":""},{"$f":"IF('DU LIEU NHAP VAO'!C166 = \"\",\"\",'DU LIEU NHAP VAO'!C166)","v":""},{"$f":"IF('DU LIEU NHAP VAO'!D166 = \"\",\"\",'DU LIEU NHAP VAO'!D166)","v":""},{"$f":"IF('DU LIEU NHAP VAO'!E166 = \"\",\"\",'DU LIEU NHAP VAO'!E166)","v":""},""]
[{"$f":"IF(C168=\"\",\"\",MAX($A$6:A167)+ 1)","v":""},"",{"$f":"IF(ISERROR(duonglich(D168)),\"\",duonglich(D168))","v":""},{"$f":"IF('DU LIEU NHAP VAO'!B167=\"\",\"\",TEXT('DU LIEU NHAP VAO'!B167,\"dd/MM\")&\"/\"&'DU LIEU NHAP VAO'!$I$6)","v":""},{"$f":"IF('DU LIEU NHAP VAO'!C167 = \"\",\"\",'DU LIEU NHAP VAO'!C167)","v":""},{"$f":"IF('DU LIEU NHAP VAO'!D167 = \"\",\"\",'DU LIEU NHAP VAO'!D167)","v":""},{"$f":"IF('DU LIEU NHAP VAO'!E167 = \"\",\"\",'DU LIEU NHAP VAO'!E167)","v":""},""]
[{"$f":"IF(C169=\"\",\"\",MAX($A$6:A168)+ 1)","v":""},"",{"$f":"IF(ISERROR(duonglich(D169)),\"\",duonglich(D169))","v":""},{"$f":"IF('DU LIEU NHAP VAO'!B168=\"\",\"\",TEXT('DU LIEU NHAP VAO'!B168,\"dd/MM\")&\"/\"&'DU LIEU NHAP VAO'!$I$6)","v":""},{"$f":"IF('DU LIEU NHAP VAO'!C168 = \"\",\"\",'DU LIEU NHAP VAO'!C168)","v":""},{"$f":"IF('DU LIEU NHAP VAO'!D168 = \"\",\"\",'DU LIEU NHAP VAO'!D168)","v":""},{"$f":"IF('DU LIEU NHAP VAO'!E168 = \"\",\"\",'DU LIEU NHAP VAO'!E168)","v":""},""]
[{"$f":"IF(C170=\"\",\"\",MAX($A$6:A169)+ 1)","v":""},"",{"$f":"IF(ISERROR(duonglich(D170)),\"\",duonglich(D170))","v":""},{"$f":"IF('DU LIEU NHAP VAO'!B169=\"\",\"\",TEXT('DU LIEU NHAP VAO'!B169,\"dd/MM\")&\"/\"&'DU LIEU NHAP VAO'!$I$6)","v":""},{"$f":"IF('DU LIEU NHAP VAO'!C169 = \"\",\"\",'DU LIEU NHAP VAO'!C169)","v":""},{"$f":"IF('DU LIEU NHAP VAO'!D169 = \"\",\"\",'DU LIEU NHAP VAO'!D169)","v":""},{"$f":"IF('DU LIEU NHAP VAO'!E169 = \"\",\"\",'DU LIEU NHAP VAO'!E169)","v":""},""]
[{"$f":"IF(C171=\"\",\"\",MAX($A$6:A170)+ 1)","v":""},"",{"$f":"IF(ISERROR(duonglich(D171)),\"\",duonglich(D171))","v":""},{"$f":"IF('DU LIEU NHAP VAO'!B170=\"\",\"\",TEXT('DU LIEU NHAP VAO'!B170,\"dd/MM\")&\"/\"&'DU LIEU NHAP VAO'!$I$6)","v":""},{"$f":"IF('DU LIEU NHAP VAO'!C170 = \"\",\"\",'DU LIEU NHAP VAO'!C170)","v":""},{"$f":"IF('DU LIEU NHAP VAO'!D170 = \"\",\"\",'DU LIEU NHAP VAO'!D170)","v":""},{"$f":"IF('DU LIEU NHAP VAO'!E170 = \"\",\"\",'DU LIEU NHAP VAO'!E170)","v":""},""]
[{"$f":"IF(C172=\"\",\"\",MAX($A$6:A171)+ 1)","v":""},"",{"$f":"IF(ISERROR(duonglich(D172)),\"\",duonglich(D172))","v":""},{"$f":"IF('DU LIEU NHAP VAO'!B171=\"\",\"\",TEXT('DU LIEU NHAP VAO'!B171,\"dd/MM\")&\"/\"&'DU LIEU NHAP VAO'!$I$6)","v":""},{"$f":"IF('DU LIEU NHAP VAO'!C171 = \"\",\"\",'DU LIEU NHAP VAO'!C171)","v":""},{"$f":"IF('DU LIEU NHAP VAO'!D171 = \"\",\"\",'DU LIEU NHAP VAO'!D171)","v":""},{"$f":"IF('DU LIEU NHAP VAO'!E171 = \"\",\"\",'DU LIEU NHAP VAO'!E171)","v":""},""]
[{"$f":"IF(C173=\"\",\"\",MAX($A$6:A172)+ 1)","v":""},"",{"$f":"IF(ISERROR(duonglich(D173)),\"\",duonglich(D173))","v":""},{"$f":"IF('DU LIEU NHAP VAO'!B172=\"\",\"\",TEXT('DU LIEU NHAP VAO'!B172,\"dd/MM\")&\"/\"&'DU LIEU NHAP VAO'!$I$6)","v":""},{"$f":"IF('DU LIEU NHAP VAO'!C172 = \"\",\"\",'DU LIEU NHAP VAO'!C172)","v":""},{"$f":"IF('DU LIEU NHAP VAO'!D172 = \"\",\"\",'DU LIEU NHAP VAO'!D172)","v":""},{"$f":"IF('DU LIEU NHAP VAO'!E172 = \"\",\"\",'DU LIEU NHAP VAO'!E172)","v":""},""]
[{"$f":"IF(C174=\"\",\"\",MAX($A$6:A173)+ 1)","v":""},"",{"$f":"IF(ISERROR(duonglich(D174)),\"\",duonglich(D174))","v":""},{"$f":"IF('DU LIEU NHAP VAO'!B173=\"\",\"\",TEXT('DU LIEU NHAP VAO'!B173,\"dd/MM\")&\"/\"&'DU LIEU NHAP VAO'!$I$6)","v":""},{"$f":"IF('DU LIEU NHAP VAO'!C173 = \"\",\"\",'DU LIEU NHAP VAO'!C173)","v":""},{"$f":"IF('DU LIEU NHAP VAO'!D173 = \"\",\"\",'DU LIEU NHAP VAO'!D173)","v":""},{"$f":"IF('DU LIEU NHAP VAO'!E173 = \"\",\"\",'DU LIEU NHAP VAO'!E173)","v":""},""]
[{"$f":"IF(C175=\"\",\"\",MAX($A$6:A174)+ 1)","v":""},"",{"$f":"IF(ISERROR(duonglich(D175)),\"\",duonglich(D175))","v":""},{"$f":"IF('DU LIEU NHAP VAO'!B174=\"\",\"\",TEXT('DU LIEU NHAP VAO'!B174,\"dd/MM\")&\"/\"&'DU LIEU NHAP VAO'!$I$6)","v":""},{"$f":"IF('DU LIEU NHAP VAO'!C174 = \"\",\"\",'DU LIEU NHAP VAO'!C174)","v":""},{"$f":"IF('DU LIEU NHAP VAO'!D174 = \"\",\"\",'DU LIEU NHAP VAO'!D174)","v":""},{"$f":"IF('DU LIEU NHAP VAO'!E174 = \"\",\"\",'DU LIEU NHAP VAO'!E174)","v":""},""]
[{"$f":"IF(C176=\"\",\"\",MAX($A$6:A175)+ 1)","v":""},"",{"$f":"IF(ISERROR(duonglich(D176)),\"\",duonglich(D176))","v":""},{"$f":"IF('DU LIEU NHAP VAO'!B175=\"\",\"\",TEXT('DU LIEU NHAP VAO'!B175,\"dd/MM\")&\"/\"&'DU LIEU NHAP VAO'!$I$6)","v":""},{"$f":"IF('DU LIEU NHAP VAO'!C175 = \"\",\"\",'DU LIEU NHAP VAO'!C175)","v":""},{"$f":"IF('DU LIEU NHAP VAO'!D175 = \"\",\"\",'DU LIEU NHAP VAO'!D175)","v":""},{"$f":"IF('DU LIEU NHAP VAO'!E175 = \"\",\"\",'DU LIEU NHAP VAO'!E175)","v":""},""]
[{"$f":"IF(C177=\"\",\"\",MAX($A$6:A176)+ 1)","v":""},"",{"$f":"IF(ISERROR(duonglich(D177)),\"\",duonglich(D177))","v":""},{"$f":"IF('DU LIEU NHAP VAO'!B176=\"\",\"\",TEXT('DU LIEU NHAP VAO'!B176,\"dd/MM\")&\"/\"&'DU LIEU NHAP VAO'!$I$6)","v":""},{"$f":"IF('DU LIEU NHAP VAO'!C176 = \"\",\"\",'DU LIEU NHAP VAO'!C176)","v":""},{"$f":"IF('DU LIEU NHAP VAO'!D176 = \"\",\"\",'DU LIEU NHAP VAO'!D176)","v":""},{"$f":"IF('DU LIEU NHAP VAO'!E176 = \"\",\"\",'DU LIEU NHAP VAO'!E176)","v":""},""]
[{"$f":"IF(C178=\"\",\"\",MAX($A$6:A177)+ 1)","v":""},"",{"$f":"IF(ISERROR(duonglich(D178)),\"\",duonglich(D178))","v":""},{"$f":"IF('DU LIEU NHAP VAO'!B177=\"\",\"\",TEXT('DU LIEU NHAP VAO'!B177,\"dd/MM\")&\"/\"&'DU LIEU NHAP VAO'!$I$6)","v":""},{"$f":"IF('DU LIEU NHAP VAO'!C177 = \"\",\"\",'DU LIEU NHAP VAO'!C177)","v":""},{"$f":"IF('DU LIEU NHAP VAO'!D177 = \"\",\"\",'DU LIEU NHAP VAO'!D177)","v":""},{"$f":"IF('DU LIEU NHAP VAO'!E177 = \"\",\"\",'DU LIEU NHAP VAO'!E177)","v":""},""]
[{"$f":"IF(C179=\"\",\"\",MAX($A$6:A178)+ 1)","v":""},"",{"$f":"IF(ISERROR(duonglich(D179)),\"\",duonglich(D179))","v":""},{"$f":"IF('DU LIEU NHAP VAO'!B178=\"\",\"\",TEXT('DU LIEU NHAP VAO'!B178,\"dd/MM\")&\"/\"&'DU LIEU NHAP VAO'!$I$6)","v":""},{"$f":"IF('DU LIEU NHAP VAO'!C178 = \"\",\"\",'DU LIEU NHAP VAO'!C178)","v":""},{"$f":"IF('DU LIEU NHAP VAO'!D178 = \"\",\"\",'DU LIEU NHAP VAO'!D178)","v":""},{"$f":"IF('DU LIEU NHAP VAO'!E178 = \"\",\"\",'DU LIEU NHAP VAO'!E178)","v":""},""]
[{"$f":"IF(C180=\"\",\"\",MAX($A$6:A179)+ 1)","v":""},"",{"$f":"IF(ISERROR(duonglich(D180)),\"\",duonglich(D180))","v":""},{"$f":"IF('DU LIEU NHAP VAO'!B179=\"\",\"\",TEXT('DU LIEU NHAP VAO'!B179,\"dd/MM\")&\"/\"&'DU LIEU NHAP VAO'!$I$6)","v":""},{"$f":"IF('DU LIEU NHAP VAO'!C179 = \"\",\"\",'DU LIEU NHAP VAO'!C179)","v":""},{"$f":"IF('DU LIEU NHAP VAO'!D179 = \"\",\"\",'DU LIEU NHAP VAO'!D179)","v":""},{"$f":"IF('DU LIEU NHAP VAO'!E179 = \"\",\"\",'DU LIEU NHAP VAO'!E179)","v":""},""]
[{"$f":"IF(C181=\"\",\"\",MAX($A$6:A180)+ 1)","v":""},"",{"$f":"IF(ISERROR(duonglich(D181)),\"\",duonglich(D181))","v":""},{"$f":"IF('DU LIEU NHAP VAO'!B180=\"\",\"\",TEXT('DU LIEU NHAP VAO'!B180,\"dd/MM\")&\"/\"&'DU LIEU NHAP VAO'!$I$6)","v":""},{"$f":"IF('DU LIEU NHAP VAO'!C180 = \"\",\"\",'DU LIEU NHAP VAO'!C180)","v":""},{"$f":"IF('DU LIEU NHAP VAO'!D180 = \"\",\"\",'DU LIEU NHAP VAO'!D180)","v":""},{"$f":"IF('DU LIEU NHAP VAO'!E180 = \"\",\"\",'DU LIEU NHAP VAO'!E180)","v":""},""]
[{"$f":"IF(C182=\"\",\"\",MAX($A$6:A181)+ 1)","v":""},"",{"$f":"IF(ISERROR(duonglich(D182)),\"\",duonglich(D182))","v":""},{"$f":"IF('DU LIEU NHAP VAO'!B181=\"\",\"\",TEXT('DU LIEU NHAP VAO'!B181,\"dd/MM\")&\"/\"&'DU LIEU NHAP VAO'!$I$6)","v":""},{"$f":"IF('DU LIEU NHAP VAO'!C181 = \"\",\"\",'DU LIEU NHAP VAO'!C181)","v":""},{"$f":"IF('DU LIEU NHAP VAO'!D181 = \"\",\"\",'DU LIEU NHAP VAO'!D181)","v":""},{"$f":"IF('DU LIEU NHAP VAO'!E181 = \"\",\"\",'DU LIEU NHAP VAO'!E181)","v":""},""]
[{"$f":"IF(C183=\"\",\"\",MAX($A$6:A182)+ 1)","v":""},"",{"$f":"IF(ISERROR(duonglich(D183)),\"\",duonglich(D183))","v":""},{"$f":"IF('DU LIEU NHAP VAO'!B182=\"\",\"\",TEXT('DU LIEU NHAP VAO'!B182,\"dd/MM\")&\"/\"&'DU LIEU NHAP VAO'!$I$6)","v":""},{"$f":"IF('DU LIEU NHAP VAO'!C182 = \"\",\"\",'DU LIEU NHAP VAO'!C182)","v":""},{"$f":"IF('DU LIEU NHAP VAO'!D182 = \"\",\"\",'DU LIEU NHAP VAO'!D182)","v":""},{"$f":"IF('DU LIEU NHAP VAO'!E182 = \"\",\"\",'DU LIEU NHAP VAO'!E182)","v":""},""]
[{"$f":"IF(C184=\"\",\"\",MAX($A$6:A183)+ 1)","v":""},"",{"$f":"IF(ISERROR(duonglich(D184)),\"\",duonglich(D184))","v":""},{"$f":"IF('DU LIEU NHAP VAO'!B183=\"\",\"\",TEXT('DU LIEU NHAP VAO'!B183,\"dd/MM\")&\"/\"&'DU LIEU NHAP VAO'!$I$6)","v":""},{"$f":"IF('DU LIEU NHAP VAO'!C183 = \"\",\"\",'DU LIEU NHAP VAO'!C183)","v":""},{"$f":"IF('DU LIEU NHAP VAO'!D183 = \"\",\"\",'DU LIEU NHAP VAO'!D183)","v":""},{"$f":"IF('DU LIEU NHAP VAO'!E183 = \"\",\"\",'DU LIEU NHAP VAO'!E183)","v":""},""]
[{"$f":"IF(C185=\"\",\"\",MAX($A$6:A184)+ 1)","v":""},"",{"$f":"IF(ISERROR(duonglich(D185)),\"\",duonglich(D185))","v":""},{"$f":"IF('DU LIEU NHAP VAO'!B184=\"\",\"\",TEXT('DU LIEU NHAP VAO'!B184,\"dd/MM\")&\"/\"&'DU LIEU NHAP VAO'!$I$6)","v":""},{"$f":"IF('DU LIEU NHAP VAO'!C184 = \"\",\"\",'DU LIEU NHAP VAO'!C184)","v":""},{"$f":"IF('DU LIEU NHAP VAO'!D184 = \"\",\"\",'DU LIEU NHAP VAO'!D184)","v":""},{"$f":"IF('DU LIEU NHAP VAO'!E184 = \"\",\"\",'DU LIEU NHAP VAO'!E184)","v":""},""]
[{"$f":"IF(C186=\"\",\"\",MAX($A$6:A185)+ 1)","v":""},"",{"$f":"IF(ISERROR(duonglich(D186)),\"\",duonglich(D186))","v":""},{"$f":"IF('DU LIEU NHAP VAO'!B185=\"\",\"\",TEXT('DU LIEU NHAP VAO'!B185,\"dd/MM\")&\"/\"&'DU LIEU NHAP VAO'!$I$6)","v":""},{"$f":"IF('DU LIEU NHAP VAO'!C185 = \"\",\"\",'DU LIEU NHAP VAO'!C185)","v":""},{"$f":"IF('DU LIEU NHAP VAO'!D185 = \"\",\"\",'DU LIEU NHAP VAO'!D185)","v":""},{"$f":"IF('DU LIEU NHAP VAO'!E185 = \"\",\"\",'DU LIEU NHAP VAO'!E185)","v":""},""]
[{"$f":"IF(C187=\"\",\"\",MAX($A$6:A186)+ 1)","v":""},"",{"$f":"IF(ISERROR(duonglich(D187)),\"\",duonglich(D187))","v":""},{"$f":"IF('DU LIEU NHAP VAO'!B186=\"\",\"\",TEXT('DU LIEU NHAP VAO'!B186,\"dd/MM\")&\"/\"&'DU LIEU NHAP VAO'!$I$6)","v":""},{"$f":"IF('DU LIEU NHAP VAO'!C186 = \"\",\"\",'DU LIEU NHAP VAO'!C186)","v":""},{"$f":"IF('DU LIEU NHAP VAO'!D186 = \"\",\"\",'DU LIEU NHAP VAO'!D186)","v":""},{"$f":"IF('DU LIEU NHAP VAO'!E186 = \"\",\"\",'DU LIEU NHAP VAO'!E186)","v":""},""]
[{"$f":"IF(C188=\"\",\"\",MAX($A$6:A187)+ 1)","v":""},"",{"$f":"IF(ISERROR(duonglich(D188)),\"\",duonglich(D188))","v":""},{"$f":"IF('DU LIEU NHAP VAO'!B187=\"\",\"\",TEXT('DU LIEU NHAP VAO'!B187,\"dd/MM\")&\"/\"&'DU LIEU NHAP VAO'!$I$6)","v":""},{"$f":"IF('DU LIEU NHAP VAO'!C187 = \"\",\"\",'DU LIEU NHAP VAO'!C187)","v":""},{"$f":"IF('DU LIEU NHAP VAO'!D187 = \"\",\"\",'DU LIEU NHAP VAO'!D187)","v":""},{"$f":"IF('DU LIEU NHAP VAO'!E187 = \"\",\"\",'DU LIEU NHAP VAO'!E187)","v":""},""]
[{"$f":"IF(C189=\"\",\"\",MAX($A$6:A188)+ 1)","v":""},"",{"$f":"IF(ISERROR(duonglich(D189)),\"\",duonglich(D189))","v":""},{"$f":"IF('DU LIEU NHAP VAO'!B188=\"\",\"\",TEXT('DU LIEU NHAP VAO'!B188,\"dd/MM\")&\"/\"&'DU LIEU NHAP VAO'!$I$6)","v":""},{"$f":"IF('DU LIEU NHAP VAO'!C188 = \"\",\"\",'DU LIEU NHAP VAO'!C188)","v":""},{"$f":"IF('DU LIEU NHAP VAO'!D188 = \"\",\"\",'DU LIEU NHAP VAO'!D188)","v":""},{"$f":"IF('DU LIEU NHAP VAO'!E188 = \"\",\"\",'DU LIEU NHAP VAO'!E188)","v":""},""]
[{"$f":"IF(C190=\"\",\"\",MAX($A$6:A189)+ 1)","v":""},"",{"$f":"IF(ISERROR(duonglich(D190)),\"\",duonglich(D190))","v":""},{"$f":"IF('DU LIEU NHAP VAO'!B189=\"\",\"\",TEXT('DU LIEU NHAP VAO'!B189,\"dd/MM\")&\"/\"&'DU LIEU NHAP VAO'!$I$6)","v":""},{"$f":"IF('DU LIEU NHAP VAO'!C189 = \"\",\"\",'DU LIEU NHAP VAO'!C189)","v":""},{"$f":"IF('DU LIEU NHAP VAO'!D189 = \"\",\"\",'DU LIEU NHAP VAO'!D189)","v":""},{"$f":"IF('DU LIEU NHAP VAO'!E189 = \"\",\"\",'DU LIEU NHAP VAO'!E189)","v":""},""]
[{"$f":"IF(C191=\"\",\"\",MAX($A$6:A190)+ 1)","v":""},"",{"$f":"IF(ISERROR(duonglich(D191)),\"\",duonglich(D191))","v":""},{"$f":"IF('DU LIEU NHAP VAO'!B190=\"\",\"\",TEXT('DU LIEU NHAP VAO'!B190,\"dd/MM\")&\"/\"&'DU LIEU NHAP VAO'!$I$6)","v":""},{"$f":"IF('DU LIEU NHAP VAO'!C190 = \"\",\"\",'DU LIEU NHAP VAO'!C190)","v":""},{"$f":"IF('DU LIEU NHAP VAO'!D190 = \"\",\"\",'DU LIEU NHAP VAO'!D190)","v":""},{"$f":"IF('DU LIEU NHAP VAO'!E190 = \"\",\"\",'DU LIEU NHAP VAO'!E190)","v":""},""]
[{"$f":"IF(C192=\"\",\"\",MAX($A$6:A191)+ 1)","v":""},"",{"$f":"IF(ISERROR(duonglich(D192)),\"\",duonglich(D192))","v":""},{"$f":"IF('DU LIEU NHAP VAO'!B191=\"\",\"\",TEXT('DU LIEU NHAP VAO'!B191,\"dd/MM\")&\"/\"&'DU LIEU NHAP VAO'!$I$6)","v":""},{"$f":"IF('DU LIEU NHAP VAO'!C191 = \"\",\"\",'DU LIEU NHAP VAO'!C191)","v":""},{"$f":"IF('DU LIEU NHAP VAO'!D191 = \"\",\"\",'DU LIEU NHAP VAO'!D191)","v":""},{"$f":"IF('DU LIEU NHAP VAO'!E191 = \"\",\"\",'DU LIEU NHAP VAO'!E191)","v":""},""]
[{"$f":"IF(C193=\"\",\"\",MAX($A$6:A192)+ 1)","v":""},"",{"$f":"IF(ISERROR(duonglich(D193)),\"\",duonglich(D193))","v":""},{"$f":"IF('DU LIEU NHAP VAO'!B192=\"\",\"\",TEXT('DU LIEU NHAP VAO'!B192,\"dd/MM\")&\"/\"&'DU LIEU NHAP VAO'!$I$6)","v":""},{"$f":"IF('DU LIEU NHAP VAO'!C192 = \"\",\"\",'DU LIEU NHAP VAO'!C192)","v":""},{"$f":"IF('DU LIEU NHAP VAO'!D192 = \"\",\"\",'DU LIEU NHAP VAO'!D192)","v":""},{"$f":"IF('DU LIEU NHAP VAO'!E192 = \"\",\"\",'DU LIEU NHAP VAO'!E192)","v":""},""]
[{"$f":"IF(C194=\"\",\"\",MAX($A$6:A193)+ 1)","v":""},"",{"$f":"IF(ISERROR(duonglich(D194)),\"\",duonglich(D194))","v":""},{"$f":"IF('DU LIEU NHAP VAO'!B193=\"\",\"\",TEXT('DU LIEU NHAP VAO'!B193,\"dd/MM\")&\"/\"&'DU LIEU NHAP VAO'!$I$6)","v":""},{"$f":"IF('DU LIEU NHAP VAO'!C193 = \"\",\"\",'DU LIEU NHAP VAO'!C193)","v":""},{"$f":"IF('DU LIEU NHAP VAO'!D193 = \"\",\"\",'DU LIEU NHAP VAO'!D193)","v":""},{"$f":"IF('DU LIEU NHAP VAO'!E193 = \"\",\"\",'DU LIEU NHAP VAO'!E193)","v":""},""]
[{"$f":"IF(C195=\"\",\"\",MAX($A$6:A194)+ 1)","v":""},"",{"$f":"IF(ISERROR(duonglich(D195)),\"\",duonglich(D195))","v":""},{"$f":"IF('DU LIEU NHAP VAO'!B194=\"\",\"\",TEXT('DU LIEU NHAP VAO'!B194,\"dd/MM\")&\"/\"&'DU LIEU NHAP VAO'!$I$6)","v":""},{"$f":"IF('DU LIEU NHAP VAO'!C194 = \"\",\"\",'DU LIEU NHAP VAO'!C194)","v":""},{"$f":"IF('DU LIEU NHAP VAO'!D194 = \"\",\"\",'DU LIEU NHAP VAO'!D194)","v":""},{"$f":"IF('DU LIEU NHAP VAO'!E194 = \"\",\"\",'DU LIEU NHAP VAO'!E194)","v":""},""]
[{"$f":"IF(C196=\"\",\"\",MAX($A$6:A195)+ 1)","v":""},"",{"$f":"IF(ISERROR(duonglich(D196)),\"\",duonglich(D196))","v":""},{"$f":"IF('DU LIEU NHAP VAO'!B195=\"\",\"\",TEXT('DU LIEU NHAP VAO'!B195,\"dd/MM\")&\"/\"&'DU LIEU NHAP VAO'!$I$6)","v":""},{"$f":"IF('DU LIEU NHAP VAO'!C195 = \"\",\"\",'DU LIEU NHAP VAO'!C195)","v":""},{"$f":"IF('DU LIEU NHAP VAO'!D195 = \"\",\"\",'DU LIEU NHAP VAO'!D195)","v":""},{"$f":"IF('DU LIEU NHAP VAO'!E195 = \"\",\"\",'DU LIEU NHAP VAO'!E195)","v":""},""]
[{"$f":"IF(C197=\"\",\"\",MAX($A$6:A196)+ 1)","v":""},"",{"$f":"IF(ISERROR(duonglich(D197)),\"\",duonglich(D197))","v":""},{"$f":"IF('DU LIEU NHAP VAO'!B196=\"\",\"\",TEXT('DU LIEU NHAP VAO'!B196,\"dd/MM\")&\"/\"&'DU LIEU NHAP VAO'!$I$6)","v":""},{"$f":"IF('DU LIEU NHAP VAO'!C196 = \"\",\"\",'DU LIEU NHAP VAO'!C196)","v":""},{"$f":"IF('DU LIEU NHAP VAO'!D196 = \"\",\"\",'DU LIEU NHAP VAO'!D196)","v":""},{"$f":"IF('DU LIEU NHAP VAO'!E196 = \"\",\"\",'DU LIEU NHAP VAO'!E196)","v":""},""]
[{"$f":"IF(C198=\"\",\"\",MAX($A$6:A197)+ 1)","v":""},"",{"$f":"IF(ISERROR(duonglich(D198)),\"\",duonglich(D198))","v":""},{"$f":"IF('DU LIEU NHAP VAO'!B197=\"\",\"\",TEXT('DU LIEU NHAP VAO'!B197,\"dd/MM\")&\"/\"&'DU LIEU NHAP VAO'!$I$6)","v":""},{"$f":"IF('DU LIEU NHAP VAO'!C197 = \"\",\"\",'DU LIEU NHAP VAO'!C197)","v":""},{"$f":"IF('DU LIEU NHAP VAO'!D197 = \"\",\"\",'DU LIEU NHAP VAO'!D197)","v":""},{"$f":"IF('DU LIEU NHAP VAO'!E197 = \"\",\"\",'DU LIEU NHAP VAO'!E197)","v":""},""]
[{"$f":"IF(C199=\"\",\"\",MAX($A$6:A198)+ 1)","v":""},{"$f":"IF(C199=\"\",\"\",IF(WEEKDAY(C199,1)=1,\"CN\",\"T\"&WEEKDAY(C199,1)))","v":""},{"$f":"IF(ISERROR(duonglich(D199)),\"\",duonglich(D199))","v":""},{"$f":"IF('DU LIEU NHAP VAO'!B198=\"\",\"\",TEXT('DU LIEU NHAP VAO'!B198,\"dd/MM\")&\"/\"&'DU LIEU NHAP VAO'!$I$6)","v":""},{"$f":"IF('DU LIEU NHAP VAO'!C198 = \"\",\"\",'DU LIEU NHAP VAO'!C198)","v":""},{"$f":"IF('DU LIEU NHAP VAO'!D198 = \"\",\"\",'DU LIEU NHAP VAO'!D198)","v":""},{"$f":"IF('DU LIEU NHAP VAO'!E198 = \"\",\"\",'DU LIEU NHAP VAO'!E198)","v":""},{"$f":"IF(E199=\"\",\"\",IF(AND(ABS(DAYS360($N$2,C199))<>0, YEAR(C199) = YEAR(NOW()),MONTH(C199) < MONTH(NOW())),\"Đã qua \"&ABS(DAYS360(C199,$N$2))&\" ngày\",\"Còn \"&ABS(DAYS360(C199,$N$2))&\" ngày\"))","v":""}]
[{"$f":"IF(C200=\"\",\"\",MAX($A$6:A199)+ 1)","v":""},"",{"$f":"IF(ISERROR(duonglich(D200)),\"\",duonglich(D200))","v":""},{"$f":"IF('DU LIEU NHAP VAO'!B199=\"\",\"\",TEXT('DU LIEU NHAP VAO'!B199,\"dd/MM\")&\"/\"&'DU LIEU NHAP VAO'!$I$6)","v":""},{"$f":"IF('DU LIEU NHAP VAO'!C199 = \"\",\"\",'DU LIEU NHAP VAO'!C199)","v":""},{"$f":"IF('DU LIEU NHAP VAO'!D199 = \"\",\"\",'DU LIEU NHAP VAO'!D199)","v":""},{"$f":"IF('DU LIEU NHAP VAO'!E199 = \"\",\"\",'DU LIEU NHAP VAO'!E199)","v":""},""]
[{"$f":"IF(C201=\"\",\"\",MAX($A$6:A200)+ 1)","v":""},"",{"$f":"IF(ISERROR(duonglich(D201)),\"\",duonglich(D201))","v":""},{"$f":"IF('DU LIEU NHAP VAO'!B200=\"\",\"\",TEXT('DU LIEU NHAP VAO'!B200,\"dd/MM\")&\"/\"&'DU LIEU NHAP VAO'!$I$6)","v":""},{"$f":"IF('DU LIEU NHAP VAO'!C200 = \"\",\"\",'DU LIEU NHAP VAO'!C200)","v":""},{"$f":"IF('DU LIEU NHAP VAO'!D200 = \"\",\"\",'DU LIEU NHAP VAO'!D200)","v":""},{"$f":"IF('DU LIEU NHAP VAO'!E200 = \"\",\"\",'DU LIEU NHAP VAO'!E200)","v":""},{"$f":"IF(E201=\"\",\"\",IF(AND(ABS(DAYS360($N$2,C201))<>0, YEAR(C201) = YEAR(NOW()),MONTH(C201) < MONTH(NOW())),\"Đã qua \"&ABS(DAYS360(C201,$N$2))&\" ngày\",\"Còn \"&ABS(DAYS360(C201,$N$2))&\" ngày\"))","v":""}]
[{"$f":"IF(C202=\"\",\"\",MAX($A$6:A201)+ 1)","v":""},"",{"$f":"IF(ISERROR(duonglich(D202)),\"\",duonglich(D202))","v":""},{"$f":"IF('DU LIEU NHAP VAO'!B201=\"\",\"\",TEXT('DU LIEU NHAP VAO'!B201,\"dd/MM\")&\"/\"&'DU LIEU NHAP VAO'!$I$6)","v":""},{"$f":"IF('DU LIEU NHAP VAO'!C201 = \"\",\"\",'DU LIEU NHAP VAO'!C201)","v":""},{"$f":"IF('DU LIEU NHAP VAO'!D201 = \"\",\"\",'DU LIEU NHAP VAO'!D201)","v":""},{"$f":"IF('DU LIEU NHAP VAO'!E201 = \"\",\"\",'DU LIEU NHAP VAO'!E201)","v":""},""]
[{"$f":"IF(C203=\"\",\"\",MAX($A$6:A202)+ 1)","v":""},"",{"$f":"IF(ISERROR(duonglich(D203)),\"\",duonglich(D203))","v":""},{"$f":"IF('DU LIEU NHAP VAO'!B202=\"\",\"\",TEXT('DU LIEU NHAP VAO'!B202,\"dd/MM\")&\"/\"&'DU LIEU NHAP VAO'!$I$6)","v":""},{"$f":"IF('DU LIEU NHAP VAO'!C202 = \"\",\"\",'DU LIEU NHAP VAO'!C202)","v":""},{"$f":"IF('DU LIEU NHAP VAO'!D202 = \"\",\"\",'DU LIEU NHAP VAO'!D202)","v":""},{"$f":"IF('DU LIEU NHAP VAO'!E202 = \"\",\"\",'DU LIEU NHAP VAO'!E202)","v":""},""]
[{"$f":"IF(C204=\"\",\"\",MAX($A$6:A203)+ 1)","v":""},"",{"$f":"IF(ISERROR(duonglich(D204)),\"\",duonglich(D204))","v":""},{"$f":"IF('DU LIEU NHAP VAO'!B203=\"\",\"\",TEXT('DU LIEU NHAP VAO'!B203,\"dd/MM\")&\"/\"&'DU LIEU NHAP VAO'!$I$6)","v":""},{"$f":"IF('DU LIEU NHAP VAO'!C203 = \"\",\"\",'DU LIEU NHAP VAO'!C203)","v":""},{"$f":"IF('DU LIEU NHAP VAO'!D203 = \"\",\"\",'DU LIEU NHAP VAO'!D203)","v":""},{"$f":"IF('DU LIEU NHAP VAO'!E203 = \"\",\"\",'DU LIEU NHAP VAO'!E203)","v":""},""]
[{"$f":"IF(C205=\"\",\"\",MAX($A$6:A204)+ 1)","v":""},"",{"$f":"IF(ISERROR(duonglich(D205)),\"\",duonglich(D205))","v":""},{"$f":"IF('DU LIEU NHAP VAO'!B204=\"\",\"\",TEXT('DU LIEU NHAP VAO'!B204,\"dd/MM\")&\"/\"&'DU LIEU NHAP VAO'!$I$6)","v":""},{"$f":"IF('DU LIEU NHAP VAO'!C204 = \"\",\"\",'DU LIEU NHAP VAO'!C204)","v":""},{"$f":"IF('DU LIEU NHAP VAO'!D204 = \"\",\"\",'DU LIEU NHAP VAO'!D204)","v":""},{"$f":"IF('DU LIEU NHAP VAO'!E204 = \"\",\"\",'DU LIEU NHAP VAO'!E204)","v":""},""]

{"sheet":"About","index":2,"n_rows":6,"n_cols":2,"rows_kept":6,"cut":false,"hidden":false,"merged":[[5,0,5,10],[2,1,2,4]]}
[]
["Thiết kế: ","Phạm Văn Phương"]
["Website cơ quan: ","http://thcstranquangkhai.edu.vn"]
[]
[]
["Phần mềm Việt hóa iSpring suite 8 (100%)(Hỗ trợ soạn bài giảng điện tử E_Learning)"]